BDBM50033699 CHEMBL8511::Sodium; (R)-3-acetoxymethyl-5,5,8-trioxo-7-[1-phenyl-meth-(E)-ylidene]-5lambda*6*-thia-1-aza-bicyclo[4.2.0]oct-2-ene-2-carboxylate
SMILES: CC(=O)OCC1=C(N2[C@@H](\C(=C\c3ccccc3)C2=O)S(=O)(=O)C1)C([O-])=O
InChI Key: InChIKey=YOCVKSISBJBEES-ROCHPLJESA-M
Data: 3 IC50
Activity Spreadsheet -- Enzyme Inhibition Constant Data from BindingDB
Found 3 hits for monomerid = 50033699
Trg + Lig
Ki
nM
ΔG°
kcal/mole
IC50
nM
Kd
nM
EC50/IC50
nM
koff
s-1
kon
M-1s-1
pHTemp
°C
Beta-lactamase
(Enterobacter cloacae)
BDBM50033699
(CHEMBL8511 | Sodium; (R)-3-acetoxymethyl-5,5,8-tri...)
Show SMILES CC(=O)OCC1=C(N2[C@@H](\C(=C\c3ccccc3)C2=O)S(=O)(=O)C1)C([O-])=O |t:5|
Show InChI InChI=1S/C17H15NO7S/c1-10(19)25-8-12-9-26(23,24)16-13(7-11-5-3-2-4-6-11)15(20)18(16)14(12)17(21)22/h2-7,16H,8-9H2,1H3,(H,21,22)/p-1/b13-7+/t16-/m1/s1
n/an/a>2.00E+4n/an/an/an/an/an/a
Southern Methodist University
Curated by ChEMBL
Assay Description
The concentration of compound to inhibit beta-lactamase was measured on E. cloacae SC 12368
J Med Chem 38: 1022-34 (1995)
BindingDB Entry DOI: 10.7270/Q29S1Q29
Beta-lactamase
(Enterobacter cloacae)
BDBM50033699
(CHEMBL8511 | Sodium; (R)-3-acetoxymethyl-5,5,8-tri...)
Show SMILES CC(=O)OCC1=C(N2[C@@H](\C(=C\c3ccccc3)C2=O)S(=O)(=O)C1)C([O-])=O |t:5|
Show InChI InChI=1S/C17H15NO7S/c1-10(19)25-8-12-9-26(23,24)16-13(7-11-5-3-2-4-6-11)15(20)18(16)14(12)17(21)22/h2-7,16H,8-9H2,1H3,(H,21,22)/p-1/b13-7+/t16-/m1/s1
n/an/a>2.00E+4n/an/an/an/an/an/a
Southern Methodist University
Curated by ChEMBL
Assay Description
The concentration of compound to inhibit beta-lactamase was measured on Enterobacter cloacae P99
J Med Chem 38: 1022-34 (1995)
BindingDB Entry DOI: 10.7270/Q29S1Q29
Beta-lactamase (TEM-1)
(Escherichia coli)
BDBM50033699
(CHEMBL8511 | Sodium; (R)-3-acetoxymethyl-5,5,8-tri...)
Show SMILES CC(=O)OCC1=C(N2[C@@H](\C(=C\c3ccccc3)C2=O)S(=O)(=O)C1)C([O-])=O |t:5|
Show InChI InChI=1S/C17H15NO7S/c1-10(19)25-8-12-9-26(23,24)16-13(7-11-5-3-2-4-6-11)15(20)18(16)14(12)17(21)22/h2-7,16H,8-9H2,1H3,(H,21,22)/p-1/b13-7+/t16-/m1/s1
n/an/a>2.00E+4n/an/an/an/an/an/a
Southern Methodist University
Curated by ChEMBL
Assay Description
The concentration of compound to inhibit beta-lactamase was measured on E. coli WC3310
J Med Chem 38: 1022-34 (1995)
BindingDB Entry DOI: 10.7270/Q29S1Q29