null
SMILES: [O-]C(=O)C(F)(F)F.CO[C@H]1CC(=O)N([C@H]1C)C(=O)CC[C@H](C)NC(=O)[C@H](CC(C)C)NC(=O)[C@H](CC(C)C)NC(=O)[C@H](C(C)C)[NH+](C)C
InChI Key: InChIKey=ZFIFRMIIWYYKND-IPTDFQASSA-O
Activity Spreadsheet -- Enzyme Inhibition Constant Data from BindingDB
Found 1 hit for monomerid = 50033706
Trg + Lig
Ki
nM
ΔG°
kcal/mole
IC50
nM
Kd
nM
EC50/IC50
nM
koff
s-1
kon
M-1s-1
pHTemp
°C
Falcipain 2
(Plasmodium falciparum)
BDBM50033706
(CHEMBL3358131)
Show SMILES [O-]C(=O)C(F)(F)F.CO[C@H]1CC(=O)N([C@H]1C)C(=O)CC[C@H](C)NC(=O)[C@H](CC(C)C)NC(=O)[C@H](CC(C)C)NC(=O)[C@H](C(C)C)[NH+](C)C |r|
Show InChI InChI=1S/C30H55N5O6/c1-17(2)14-22(32-29(39)23(15-18(3)4)33-30(40)27(19(5)6)34(9)10)28(38)31-20(7)12-13-25(36)35-21(8)24(41-11)16-26(35)37/h17-24,27H,12-16H2,1-11H3,(H,31,38)(H,32,39)(H,33,40)/p+1/t20-,21-,22-,23-,24-,27-/m0/s1
n/an/a>5.00E+4n/an/an/an/an/an/a
The University of Sydney
Curated by ChEMBL
Assay Description
Inhibition of Plasmodium falciparum FP2 using Z-Phe-Arg-AMC as substrate incubated for 30 mins prior to substrate addition measured after 30 mins by ...
J Med Chem 57: 10557-63 (2014)
Article DOI: 10.1021/jm501439w
BindingDB Entry DOI: 10.7270/Q2TM7CQW