BDBM50034014 (S)-4-Ethyl-4-hydroxy-11-methyl-3,13-dioxo-3,4,12,13-tetrahydro-1H-2-oxa-6,8,12a-triaza-dibenzo[b,h]fluorene-9-carbonitrile::4-Ethyl-4-hydroxy-11-methyl-3,13-dioxo-3,4,12,13-tetrahydro-1H-2-oxa-6,8,12a-triaza-dibenzo[b,h]fluorene-9-carbonitrile::CHEMBL13998
SMILES: CC[C@@]1(O)C(=O)OCc2c1cc1-c3nc4cnc(cc4c(C)c3Cn1c2=O)C#N
InChI Key: InChIKey=QBEZNPSUEOUWPW-NRFANRHFSA-N
Data: 2 IC50
Activity Spreadsheet -- Enzyme Inhibition Constant Data from BindingDB
Found 2 hits for monomerid = 50034014
Trg + Lig
Ki
nM
ΔG°
kcal/mole
IC50
nM
Kd
nM
EC50/IC50
nM
koff
s-1
kon
M-1s-1
pHTemp
°C
DNA topoisomerase I (Topo I)
(Homo sapiens (Human))
BDBM50034014
((S)-4-Ethyl-4-hydroxy-11-methyl-3,13-dioxo-3,4,12,...)
Show SMILES CC[C@@]1(O)C(=O)OCc2c1cc1-c3nc4cnc(cc4c(C)c3Cn1c2=O)C#N
Show InChI InChI=1S/C21H16N4O4/c1-3-21(28)15-5-17-18-13(8-25(17)19(26)14(15)9-29-20(21)27)10(2)12-4-11(6-22)23-7-16(12)24-18/h4-5,7,28H,3,8-9H2,1-2H3/t21-/m0/s1
n/an/a 143n/an/an/an/an/an/a
NeoGenesis, Inc.
Curated by ChEMBL
Assay Description
Inhibitory activity against DNA topoisomerase I
J Med Chem 43: 1993-2006 (2000)
BindingDB Entry DOI: 10.7270/Q2MP53ZS
DNA topoisomerase I (Topo I)
(Homo sapiens (Human))
BDBM50034014
((S)-4-Ethyl-4-hydroxy-11-methyl-3,13-dioxo-3,4,12,...)
Show SMILES CC[C@@]1(O)C(=O)OCc2c1cc1-c3nc4cnc(cc4c(C)c3Cn1c2=O)C#N
Show InChI InChI=1S/C21H16N4O4/c1-3-21(28)15-5-17-18-13(8-25(17)19(26)14(15)9-29-20(21)27)10(2)12-4-11(6-22)23-7-16(12)24-18/h4-5,7,28H,3,8-9H2,1-2H3/t21-/m0/s1
n/an/a 143n/an/an/an/an/an/a
Glaxo Inc.
Curated by ChEMBL
Assay Description
In vitro fragmentation of DNA in the presence of excess calf thymus topoisomerase.
J Med Chem 38: 1106-18 (1995)
BindingDB Entry DOI: 10.7270/Q2X067P4