null
SMILES: CC(C)Oc1ccc(cc1Cl)-c1nc(no1)-c1ccc2CCN(CCC(O)=O)CCc2c1
InChI Key: InChIKey=LQLCBKNCYQPZER-UHFFFAOYSA-N
Activity Spreadsheet -- Enzyme Inhibition Constant Data from BindingDB
Found 2 hits for monomerid = 50034565
Trg + Lig
Ki
nM
ΔG°
kcal/mole
IC50
nM
Kd
nM
EC50/IC50
nM
koff
s-1
kon
M-1s-1
pHTemp
°C
Sphingosine 1-phosphate receptor 1
(Homo sapiens (Human))
BDBM50034565
(CHEMBL3359846)
Show SMILES CC(C)Oc1ccc(cc1Cl)-c1nc(no1)-c1ccc2CCN(CCC(O)=O)CCc2c1
Show InChI InChI=1S/C24H26ClN3O4/c1-15(2)31-21-6-5-19(14-20(21)25)24-26-23(27-32-24)18-4-3-16-7-10-28(12-9-22(29)30)11-8-17(16)13-18/h3-6,13-15H,7-12H2,1-2H3,(H,29,30)
Reactome pathway
n/an/an/an/a 7.90n/an/an/an/a
GlaxoSmithKline
Curated by ChEMBL
Assay Description
Agonist activity at human S1P1R expressed in RH7777 membranes assessed as [35S]GTPgammaS binding after 30 mins
J Med Chem 57: 10424-42 (2014)
Article DOI: 10.1021/jm5010336
BindingDB Entry DOI: 10.7270/Q2DF6SSX
Sphingosine 1-phosphate receptor 3
(Homo sapiens (Human))
BDBM50034565
(CHEMBL3359846)
Show SMILES CC(C)Oc1ccc(cc1Cl)-c1nc(no1)-c1ccc2CCN(CCC(O)=O)CCc2c1
Show InChI InChI=1S/C24H26ClN3O4/c1-15(2)31-21-6-5-19(14-20(21)25)24-26-23(27-32-24)18-4-3-16-7-10-28(12-9-22(29)30)11-8-17(16)13-18/h3-6,13-15H,7-12H2,1-2H3,(H,29,30)
NCI pathway
Reactome pathway
n/an/an/an/a 1.00E+4n/an/an/an/a
GlaxoSmithKline
Curated by ChEMBL
Assay Description
Agonist activity at human S1P3R expressed in RBL membranes assessed as [35S]GTPgammaS binding after 30 mins
J Med Chem 57: 10424-42 (2014)
Article DOI: 10.1021/jm5010336
BindingDB Entry DOI: 10.7270/Q2DF6SSX