BDBM50034631 CHEMBL3360365
SMILES: CC(C)Oc1ccc(cc1Cl)-c1nc(no1)-c1cccc2CNCCc12
InChI Key: InChIKey=NVLKMKAPBOZFEE-UHFFFAOYSA-N
Data: 2 EC50
Activity Spreadsheet -- Enzyme Inhibition Constant Data from BindingDB
Found 2 hits for monomerid = 50034631
Trg + Lig
Ki
nM
ΔG°
kcal/mole
IC50
nM
Kd
nM
EC50/IC50
nM
koff
s-1
kon
M-1s-1
pHTemp
°C
Sphingosine 1-phosphate receptor 1
(Homo sapiens (Human))
BDBM50034631
(CHEMBL3360365)
Show SMILES CC(C)Oc1ccc(cc1Cl)-c1nc(no1)-c1cccc2CNCCc12
Show InChI InChI=1S/C20H20ClN3O2/c1-12(2)25-18-7-6-13(10-17(18)21)20-23-19(24-26-20)16-5-3-4-14-11-22-9-8-15(14)16/h3-7,10,12,22H,8-9,11H2,1-2H3
Reactome pathway
n/an/an/an/a 40n/an/an/an/a
GlaxoSmithKline
Curated by ChEMBL
Assay Description
Agonist activity at human S1P1R expressed in RH7777 membranes assessed as [35S]GTPgammaS binding after 30 mins
J Med Chem 57: 10424-42 (2014)
Article DOI: 10.1021/jm5010336
BindingDB Entry DOI: 10.7270/Q2DF6SSX
Sphingosine 1-phosphate receptor 3
(Homo sapiens (Human))
BDBM50034631
(CHEMBL3360365)
Show SMILES CC(C)Oc1ccc(cc1Cl)-c1nc(no1)-c1cccc2CNCCc12
Show InChI InChI=1S/C20H20ClN3O2/c1-12(2)25-18-7-6-13(10-17(18)21)20-23-19(24-26-20)16-5-3-4-14-11-22-9-8-15(14)16/h3-7,10,12,22H,8-9,11H2,1-2H3
NCI pathway
Reactome pathway
n/an/an/an/a 1.58E+4n/an/an/an/a
GlaxoSmithKline
Curated by ChEMBL
Assay Description
Agonist activity at human S1P3R expressed in RBL membranes assessed as [35S]GTPgammaS binding after 30 mins
J Med Chem 57: 10424-42 (2014)
Article DOI: 10.1021/jm5010336
BindingDB Entry DOI: 10.7270/Q2DF6SSX