BDBM50034840 (2R,4S)-5-Biphenyl-4-yl-4-(2-carboxy-ethylcarbamoyl)-2-methyl-pentanoic acid::CHEMBL44767
SMILES: C[C@H](C[C@@H](Cc1ccc(cc1)-c1ccccc1)C(=O)NCCC(O)=O)C(O)=O
InChI Key: InChIKey=WNXCXPRMZCGVNM-BEFAXECRSA-N
Data: 1 IC50
Activity Spreadsheet -- Enzyme Inhibition Constant Data from BindingDB
Found 1 hit for monomerid = 50034840
Trg + Lig
Ki
nM
ΔG°
kcal/mole
IC50
nM
Kd
nM
EC50/IC50
nM
koff
s-1
kon
M-1s-1
pHTemp
°C
Neutral Endopeptidase (NEP)
(Rattus norvegicus (Rat))
BDBM50034840
((2R,4S)-5-Biphenyl-4-yl-4-(2-carboxy-ethylcarbamoy...)
Show SMILES C[C@H](C[C@@H](Cc1ccc(cc1)-c1ccccc1)C(=O)NCCC(O)=O)C(O)=O
Show InChI InChI=1S/C22H25NO5/c1-15(22(27)28)13-19(21(26)23-12-11-20(24)25)14-16-7-9-18(10-8-16)17-5-3-2-4-6-17/h2-10,15,19H,11-14H2,1H3,(H,23,26)(H,24,25)(H,27,28)/t15-,19+/m1/s1
Reactome pathway
n/an/a 41n/an/an/an/an/an/a
CIBA-GEIGY Corporation
Curated by ChEMBL
Assay Description
In vitro inhibition of rat neutral endopeptidase by using GAAP as substrate
J Med Chem 38: 1689-700 (1995)
BindingDB Entry DOI: 10.7270/Q2Z89BD0