BDBM50034850 (R)-2-[(S)-3-Biphenyl-4-yl-2-(2-carboxy-2-hydroxy-ethylcarbamoyl)-propyl]-hexanoic acid::CHEMBL296760
SMILES: CCCC[C@H](C[C@@H](Cc1ccc(cc1)-c1ccccc1)C(=O)NCC(O)C(O)=O)C(O)=O
InChI Key: InChIKey=MKBUPSIAEKNMBU-JAZPPYFYSA-N
Data: 1 IC50
Activity Spreadsheet -- Enzyme Inhibition Constant Data from BindingDB
Found 1 hit for monomerid = 50034850
Trg + Lig
Ki
nM
ΔG°
kcal/mole
IC50
nM
Kd
nM
EC50/IC50
nM
koff
s-1
kon
M-1s-1
pHTemp
°C
Neutral Endopeptidase (NEP)
(Rattus norvegicus (Rat))
BDBM50034850
((R)-2-[(S)-3-Biphenyl-4-yl-2-(2-carboxy-2-hydroxy-...)
Show SMILES CCCC[C@H](C[C@@H](Cc1ccc(cc1)-c1ccccc1)C(=O)NCC(O)C(O)=O)C(O)=O
Show InChI InChI=1S/C25H31NO6/c1-2-3-7-20(24(29)30)15-21(23(28)26-16-22(27)25(31)32)14-17-10-12-19(13-11-17)18-8-5-4-6-9-18/h4-6,8-13,20-22,27H,2-3,7,14-16H2,1H3,(H,26,28)(H,29,30)(H,31,32)/t20-,21-,22?/m1/s1
Reactome pathway
n/an/a 21n/an/an/an/an/an/a
CIBA-GEIGY Corporation
Curated by ChEMBL
Assay Description
In vitro inhibition of rat neutral endopeptidase by using GAAP as substrate
J Med Chem 38: 1689-700 (1995)
BindingDB Entry DOI: 10.7270/Q2Z89BD0