BDBM50034859 4-(2-Carboxy-ethylcarbamoyl)-2-(4-isopropyl-benzyl)-5-(4-isopropyl-phenyl)-pentanoic acid::CHEMBL46201
SMILES: CC(C)c1ccc(CC(CC(Cc2ccc(cc2)C(C)C)C(=O)NCCC(O)=O)C(O)=O)cc1
InChI Key: InChIKey=ZEQQXVQIWDVZTH-UHFFFAOYSA-N
Data: 1 IC50
Activity Spreadsheet -- Enzyme Inhibition Constant Data from BindingDB
Found 1 hit for monomerid = 50034859
Trg + Lig
Ki
nM
ΔG°
kcal/mole
IC50
nM
Kd
nM
EC50/IC50
nM
koff
s-1
kon
M-1s-1
pHTemp
°C
Neutral Endopeptidase (NEP)
(Rattus norvegicus (Rat))
BDBM50034859
(4-(2-Carboxy-ethylcarbamoyl)-2-(4-isopropyl-benzyl...)
Show SMILES CC(C)c1ccc(CC(CC(Cc2ccc(cc2)C(C)C)C(=O)NCCC(O)=O)C(O)=O)cc1
Show InChI InChI=1S/C28H37NO5/c1-18(2)22-9-5-20(6-10-22)15-24(27(32)29-14-13-26(30)31)17-25(28(33)34)16-21-7-11-23(12-8-21)19(3)4/h5-12,18-19,24-25H,13-17H2,1-4H3,(H,29,32)(H,30,31)(H,33,34)
Reactome pathway
n/an/a 489n/an/an/an/an/an/a
CIBA-GEIGY Corporation
Curated by ChEMBL
Assay Description
In vitro inhibition of rat neutral endopeptidase by using GAAP as substrate
J Med Chem 38: 1689-700 (1995)
BindingDB Entry DOI: 10.7270/Q2Z89BD0