BDBM50035730 3-(3,4-Dichloro-phenyl)-8-methyl-8-aza-bicyclo[3.2.1]octane-2-carboxylic acid methyl ester::3-(4-Fluoro-phenyl)-8-methyl-8-aza-bicyclo[3.2.1]octane-2-carboxylic acid methyl ester::CHEMBL87031::methyl 3-(3,4-dichlorophenyl)-8-methyl-8-azabicyclo[3.2.1]octane-2-carboxylate
SMILES: COC(=O)C1C2CCC(CC1c1ccc(Cl)c(Cl)c1)N2C
InChI Key: InChIKey=AMIHUYQKNJHXPT-UHFFFAOYSA-N
Data: 23 IC50
Activity Spreadsheet -- Enzyme Inhibition Constant Data from BindingDB
Found 23 hits for monomerid = 50035730
Trg + Lig
Ki
nM
ΔG°
kcal/mole
IC50
nM
Kd
nM
EC50/IC50
nM
koff
s-1
kon
M-1s-1
pHTemp
°C
Dopamine transporter
(Macaca fascicularis)
BDBM50035730
(3-(3,4-Dichloro-phenyl)-8-methyl-8-aza-bicyclo[3.2...)
Show SMILES COC(=O)C1C2CCC(CC1c1ccc(Cl)c(Cl)c1)N2C |TLB:20:19:4.10.9:6.7,THB:11:10:19:6.7,2:4:19:6.7|
Show InChI InChI=1S/C16H19Cl2NO2/c1-19-10-4-6-14(19)15(16(20)21-2)11(8-10)9-3-5-12(17)13(18)7-9/h3,5,7,10-11,14-15H,4,6,8H2,1-2H3
n/an/a 0.380n/an/an/an/an/an/a
Organix Inc
Curated by ChEMBL
Assay Description
Inhibition of [3H]WIN-35428 binding to dopamine transporter (DAT) of cynomolgus monkey caudate-putamen
Bioorg Med Chem Lett 9: 857-62 (1999)
BindingDB Entry DOI: 10.7270/Q26D5TGQ
Dopamine transporter
(Macaca fascicularis)
BDBM50035730
(3-(3,4-Dichloro-phenyl)-8-methyl-8-aza-bicyclo[3.2...)
Show SMILES COC(=O)C1C2CCC(CC1c1ccc(Cl)c(Cl)c1)N2C |TLB:20:19:4.10.9:6.7,THB:11:10:19:6.7,2:4:19:6.7|
Show InChI InChI=1S/C16H19Cl2NO2/c1-19-10-4-6-14(19)15(16(20)21-2)11(8-10)9-3-5-12(17)13(18)7-9/h3,5,7,10-11,14-15H,4,6,8H2,1-2H3
n/an/a 1.10n/an/an/an/an/an/a
Organix Inc
Curated by ChEMBL
Assay Description
Inhibition of [3H]WIN-35428 binding to dopamine transporter (DAT) of cynomolgus monkey caudate-putamen
Bioorg Med Chem Lett 9: 857-62 (1999)
BindingDB Entry DOI: 10.7270/Q26D5TGQ
Sodium-dependent dopamine transporter
(Homo sapiens (Human))
BDBM50035730
(3-(3,4-Dichloro-phenyl)-8-methyl-8-aza-bicyclo[3.2...)
Show SMILES COC(=O)C1C2CCC(CC1c1ccc(Cl)c(Cl)c1)N2C |TLB:20:19:4.10.9:6.7,THB:11:10:19:6.7,2:4:19:6.7|
Show InChI InChI=1S/C16H19Cl2NO2/c1-19-10-4-6-14(19)15(16(20)21-2)11(8-10)9-3-5-12(17)13(18)7-9/h3,5,7,10-11,14-15H,4,6,8H2,1-2H3
NCI pathway
Reactome pathway
n/an/a 0.400n/an/an/an/an/an/a
Organix Inc.
Curated by ChEMBL
Assay Description
inhibition of [3H]WIN-35428 binding to the dopamine transporter (DAT) in monkey caudate-putamen.
J Med Chem 40: 2661-73 (1997)
Article DOI: 10.1021/jm9703045
BindingDB Entry DOI: 10.7270/Q23T9HXJ
Sodium-dependent serotonin transporter
(Homo sapiens (Human))
BDBM50035730
(3-(3,4-Dichloro-phenyl)-8-methyl-8-aza-bicyclo[3.2...)
Show SMILES COC(=O)C1C2CCC(CC1c1ccc(Cl)c(Cl)c1)N2C |TLB:20:19:4.10.9:6.7,THB:11:10:19:6.7,2:4:19:6.7|
Show InChI InChI=1S/C16H19Cl2NO2/c1-19-10-4-6-14(19)15(16(20)21-2)11(8-10)9-3-5-12(17)13(18)7-9/h3,5,7,10-11,14-15H,4,6,8H2,1-2H3
n/an/a 2.5n/an/an/an/an/an/a
Organix Inc
Curated by ChEMBL
Assay Description
Inhibition of [3H]citalopram binding to serotonin transporter (SERT) of cynomolgus monkey caudate-putamen
Bioorg Med Chem Lett 9: 857-62 (1999)
BindingDB Entry DOI: 10.7270/Q26D5TGQ
Sodium-dependent serotonin transporter
(Homo sapiens (Human))
BDBM50035730
(3-(3,4-Dichloro-phenyl)-8-methyl-8-aza-bicyclo[3.2...)
Show SMILES COC(=O)C1C2CCC(CC1c1ccc(Cl)c(Cl)c1)N2C |TLB:20:19:4.10.9:6.7,THB:11:10:19:6.7,2:4:19:6.7|
Show InChI InChI=1S/C16H19Cl2NO2/c1-19-10-4-6-14(19)15(16(20)21-2)11(8-10)9-3-5-12(17)13(18)7-9/h3,5,7,10-11,14-15H,4,6,8H2,1-2H3
n/an/a 2.5n/an/an/an/an/an/a
Organix Inc.
Curated by ChEMBL
Assay Description
Ability to inhibit [3H]citalopram binding to serotonin transporter in cynomolgus monkey striatum
J Med Chem 36: 855-62 (1993)
BindingDB Entry DOI: 10.7270/Q2NC61V6
Sodium-dependent dopamine transporter
(Homo sapiens (Human))
BDBM50035730
(3-(3,4-Dichloro-phenyl)-8-methyl-8-aza-bicyclo[3.2...)
Show SMILES COC(=O)C1C2CCC(CC1c1ccc(Cl)c(Cl)c1)N2C |TLB:20:19:4.10.9:6.7,THB:11:10:19:6.7,2:4:19:6.7|
Show InChI InChI=1S/C16H19Cl2NO2/c1-19-10-4-6-14(19)15(16(20)21-2)11(8-10)9-3-5-12(17)13(18)7-9/h3,5,7,10-11,14-15H,4,6,8H2,1-2H3
NCI pathway
Reactome pathway
n/an/a 1.10n/an/an/an/an/an/a
Organix Inc.
Curated by ChEMBL
Assay Description
Inhibition of [3H]3-beta-(4-fluorophenyl)tropane-2beta-carboxylic acid methyl ester binding to dopamine transporter of cynomolgus monkey striatum
J Med Chem 36: 855-62 (1993)
BindingDB Entry DOI: 10.7270/Q2NC61V6
Sodium-dependent dopamine transporter
(Homo sapiens (Human))
BDBM50035730
(3-(3,4-Dichloro-phenyl)-8-methyl-8-aza-bicyclo[3.2...)
Show SMILES COC(=O)C1C2CCC(CC1c1ccc(Cl)c(Cl)c1)N2C |TLB:20:19:4.10.9:6.7,THB:11:10:19:6.7,2:4:19:6.7|
Show InChI InChI=1S/C16H19Cl2NO2/c1-19-10-4-6-14(19)15(16(20)21-2)11(8-10)9-3-5-12(17)13(18)7-9/h3,5,7,10-11,14-15H,4,6,8H2,1-2H3
NCI pathway
Reactome pathway
n/an/a 1.10n/an/an/an/an/an/a
Organix Inc.
Curated by ChEMBL
Assay Description
inhibition of [3H]WIN-35428 binding to the dopamine transporter (DAT) in monkey caudate-putamen.
J Med Chem 40: 2661-73 (1997)
Article DOI: 10.1021/jm9703045
BindingDB Entry DOI: 10.7270/Q23T9HXJ
Sodium-dependent serotonin transporter
(Homo sapiens (Human))
BDBM50035730
(3-(3,4-Dichloro-phenyl)-8-methyl-8-aza-bicyclo[3.2...)
Show SMILES COC(=O)C1C2CCC(CC1c1ccc(Cl)c(Cl)c1)N2C |TLB:20:19:4.10.9:6.7,THB:11:10:19:6.7,2:4:19:6.7|
Show InChI InChI=1S/C16H19Cl2NO2/c1-19-10-4-6-14(19)15(16(20)21-2)11(8-10)9-3-5-12(17)13(18)7-9/h3,5,7,10-11,14-15H,4,6,8H2,1-2H3
n/an/a 27n/an/an/an/an/an/a
Organix Inc.
Curated by ChEMBL
Assay Description
Inhibition of [3H]citalopram binding to the serotonin transporter (5-HT) in monkey caudate-putamen.
J Med Chem 40: 2661-73 (1997)
Article DOI: 10.1021/jm9703045
BindingDB Entry DOI: 10.7270/Q23T9HXJ
Sodium-dependent serotonin transporter
(Rattus norvegicus (rat))
BDBM50035730
(3-(3,4-Dichloro-phenyl)-8-methyl-8-aza-bicyclo[3.2...)
Show SMILES COC(=O)C1C2CCC(CC1c1ccc(Cl)c(Cl)c1)N2C |TLB:20:19:4.10.9:6.7,THB:11:10:19:6.7,2:4:19:6.7|
Show InChI InChI=1S/C16H19Cl2NO2/c1-19-10-4-6-14(19)15(16(20)21-2)11(8-10)9-3-5-12(17)13(18)7-9/h3,5,7,10-11,14-15H,4,6,8H2,1-2H3
n/an/a 3.10n/an/an/an/an/an/a
Research Triangle Institute
Curated by ChEMBL
Assay Description
Binding affinity at the Serotonin transporter in rat midbrain by inhibition of 0.5 nM [3H]-paroxetine binding
J Med Chem 38: 379-88 (1995)
BindingDB Entry DOI: 10.7270/Q2D50NM0
Sodium-dependent dopamine transporter
(Rattus norvegicus (rat))
BDBM50035730
(3-(3,4-Dichloro-phenyl)-8-methyl-8-aza-bicyclo[3.2...)
Show SMILES COC(=O)C1C2CCC(CC1c1ccc(Cl)c(Cl)c1)N2C |TLB:20:19:4.10.9:6.7,THB:11:10:19:6.7,2:4:19:6.7|
Show InChI InChI=1S/C16H19Cl2NO2/c1-19-10-4-6-14(19)15(16(20)21-2)11(8-10)9-3-5-12(17)13(18)7-9/h3,5,7,10-11,14-15H,4,6,8H2,1-2H3
Reactome pathway
n/an/a 0.790n/an/an/an/an/an/a
Research Triangle Institute
Curated by ChEMBL
Assay Description
Binding affinity at the Dopamine transporter in rat striata by inhibition of 0.5 nM [3H]WIN-35428 binding
J Med Chem 38: 379-88 (1995)
BindingDB Entry DOI: 10.7270/Q2D50NM0
Norepinephrine Monoamine transporters
(Rattus norvegicus)
BDBM50035730
(3-(3,4-Dichloro-phenyl)-8-methyl-8-aza-bicyclo[3.2...)
Show SMILES COC(=O)C1C2CCC(CC1c1ccc(Cl)c(Cl)c1)N2C |TLB:20:19:4.10.9:6.7,THB:11:10:19:6.7,2:4:19:6.7|
Show InChI InChI=1S/C16H19Cl2NO2/c1-19-10-4-6-14(19)15(16(20)21-2)11(8-10)9-3-5-12(17)13(18)7-9/h3,5,7,10-11,14-15H,4,6,8H2,1-2H3
Reactome pathway
n/an/a 18n/an/an/an/an/an/a
Research Triangle Institute
Curated by ChEMBL
Assay Description
Binding affinity at the Norepinephrine transporter in rat frontal cortex by inhibition of 0.5 nM [3H]nisoxetine binding
J Med Chem 38: 379-88 (1995)
BindingDB Entry DOI: 10.7270/Q2D50NM0
Sodium-dependent serotonin transporter
(Homo sapiens (Human))
BDBM50035730
(3-(3,4-Dichloro-phenyl)-8-methyl-8-aza-bicyclo[3.2...)
Show SMILES COC(=O)C1C2CCC(CC1c1ccc(Cl)c(Cl)c1)N2C |TLB:20:19:4.10.9:6.7,THB:11:10:19:6.7,2:4:19:6.7|
Show InChI InChI=1S/C16H19Cl2NO2/c1-19-10-4-6-14(19)15(16(20)21-2)11(8-10)9-3-5-12(17)13(18)7-9/h3,5,7,10-11,14-15H,4,6,8H2,1-2H3
n/an/a 2n/an/an/an/an/an/a
Organix Inc.
Curated by ChEMBL
Assay Description
Inhibition of [3H]citalopram binding to the serotonin transporter in cynomolgus (macaca fascicularis) monkey caudate putamen.
J Med Chem 43: 2982-91 (2000)
BindingDB Entry DOI: 10.7270/Q2CZ37VX
Sodium-dependent dopamine transporter
(Homo sapiens (Human))
BDBM50035730
(3-(3,4-Dichloro-phenyl)-8-methyl-8-aza-bicyclo[3.2...)
Show SMILES COC(=O)C1C2CCC(CC1c1ccc(Cl)c(Cl)c1)N2C |TLB:20:19:4.10.9:6.7,THB:11:10:19:6.7,2:4:19:6.7|
Show InChI InChI=1S/C16H19Cl2NO2/c1-19-10-4-6-14(19)15(16(20)21-2)11(8-10)9-3-5-12(17)13(18)7-9/h3,5,7,10-11,14-15H,4,6,8H2,1-2H3
NCI pathway
Reactome pathway
n/an/a 0.400n/an/an/an/an/an/a
Organix Inc.
Curated by ChEMBL
Assay Description
Inhibition of [3H]WIN-35428 binding to the dopamine transporter in cynomolgus (macaca fascicularis) monkey caudate putamen.
J Med Chem 43: 2982-91 (2000)
BindingDB Entry DOI: 10.7270/Q2CZ37VX
Sodium-dependent serotonin transporter
(Homo sapiens (Human))
BDBM50035730
(3-(3,4-Dichloro-phenyl)-8-methyl-8-aza-bicyclo[3.2...)
Show SMILES COC(=O)C1C2CCC(CC1c1ccc(Cl)c(Cl)c1)N2C |TLB:20:19:4.10.9:6.7,THB:11:10:19:6.7,2:4:19:6.7|
Show InChI InChI=1S/C16H19Cl2NO2/c1-19-10-4-6-14(19)15(16(20)21-2)11(8-10)9-3-5-12(17)13(18)7-9/h3,5,7,10-11,14-15H,4,6,8H2,1-2H3
n/an/a 358n/an/an/an/an/an/a
Organix Inc.
Curated by ChEMBL
Assay Description
Inhibition of [3H]citalopram binding to the serotonin transporter in cynomolgus (macaca fascicularis) monkey caudate putamen.
J Med Chem 43: 2982-91 (2000)
BindingDB Entry DOI: 10.7270/Q2CZ37VX
Sodium-dependent dopamine transporter
(Homo sapiens (Human))
BDBM50035730
(3-(3,4-Dichloro-phenyl)-8-methyl-8-aza-bicyclo[3.2...)
Show SMILES COC(=O)C1C2CCC(CC1c1ccc(Cl)c(Cl)c1)N2C |TLB:20:19:4.10.9:6.7,THB:11:10:19:6.7,2:4:19:6.7|
Show InChI InChI=1S/C16H19Cl2NO2/c1-19-10-4-6-14(19)15(16(20)21-2)11(8-10)9-3-5-12(17)13(18)7-9/h3,5,7,10-11,14-15H,4,6,8H2,1-2H3
NCI pathway
Reactome pathway
n/an/a 0.400n/an/an/an/an/an/a
Organix Inc.
Curated by ChEMBL
Assay Description
Inhibition of [3H]WIN-35428 binding to the dopamine transporter in cynomolgus (macaca fascicularis) monkey caudate putamen.
J Med Chem 43: 2982-91 (2000)
BindingDB Entry DOI: 10.7270/Q2CZ37VX
Sodium-dependent dopamine transporter
(Homo sapiens (Human))
BDBM50035730
(3-(3,4-Dichloro-phenyl)-8-methyl-8-aza-bicyclo[3.2...)
Show SMILES COC(=O)C1C2CCC(CC1c1ccc(Cl)c(Cl)c1)N2C |TLB:20:19:4.10.9:6.7,THB:11:10:19:6.7,2:4:19:6.7|
Show InChI InChI=1S/C16H19Cl2NO2/c1-19-10-4-6-14(19)15(16(20)21-2)11(8-10)9-3-5-12(17)13(18)7-9/h3,5,7,10-11,14-15H,4,6,8H2,1-2H3
NCI pathway
Reactome pathway
n/an/a 0.400n/an/an/an/an/an/a
Organix Inc.
Curated by ChEMBL
Assay Description
Inhibition of [3H]WIN-35428 binding to the dopamine transporter in cynomolgus (macaca fascicularis) monkey caudate putamen.
J Med Chem 43: 2982-91 (2000)
BindingDB Entry DOI: 10.7270/Q2CZ37VX
Sodium-dependent serotonin transporter
(Homo sapiens (Human))
BDBM50035730
(3-(3,4-Dichloro-phenyl)-8-methyl-8-aza-bicyclo[3.2...)
Show SMILES COC(=O)C1C2CCC(CC1c1ccc(Cl)c(Cl)c1)N2C |TLB:20:19:4.10.9:6.7,THB:11:10:19:6.7,2:4:19:6.7|
Show InChI InChI=1S/C16H19Cl2NO2/c1-19-10-4-6-14(19)15(16(20)21-2)11(8-10)9-3-5-12(17)13(18)7-9/h3,5,7,10-11,14-15H,4,6,8H2,1-2H3
n/an/a 27n/an/an/an/an/an/a
Organix Inc.
Curated by ChEMBL
Assay Description
Inhibition of [3H]citalopram binding to the serotonin transporter in cynomolgus (macaca fascicularis) monkey caudate putamen.
J Med Chem 43: 2982-91 (2000)
BindingDB Entry DOI: 10.7270/Q2CZ37VX
Sodium-dependent dopamine transporter
(Homo sapiens (Human))
BDBM50035730
(3-(3,4-Dichloro-phenyl)-8-methyl-8-aza-bicyclo[3.2...)
Show SMILES COC(=O)C1C2CCC(CC1c1ccc(Cl)c(Cl)c1)N2C |TLB:20:19:4.10.9:6.7,THB:11:10:19:6.7,2:4:19:6.7|
Show InChI InChI=1S/C16H19Cl2NO2/c1-19-10-4-6-14(19)15(16(20)21-2)11(8-10)9-3-5-12(17)13(18)7-9/h3,5,7,10-11,14-15H,4,6,8H2,1-2H3
NCI pathway
Reactome pathway
n/an/a 1.09n/an/an/an/an/an/a
Organix Inc.
Curated by ChEMBL
Assay Description
Inhibition of [3H]WIN-35428 binding to Dopamine transporter in rhesus (Macaca mulatta) or cynomolgus monkey (Macaca fascicularis) caudate-putamen
J Med Chem 44: 2619-35 (2001)
BindingDB Entry DOI: 10.7270/Q2K35VC3
Sodium-dependent serotonin transporter
(Homo sapiens (Human))
BDBM50035730
(3-(3,4-Dichloro-phenyl)-8-methyl-8-aza-bicyclo[3.2...)
Show SMILES COC(=O)C1C2CCC(CC1c1ccc(Cl)c(Cl)c1)N2C |TLB:20:19:4.10.9:6.7,THB:11:10:19:6.7,2:4:19:6.7|
Show InChI InChI=1S/C16H19Cl2NO2/c1-19-10-4-6-14(19)15(16(20)21-2)11(8-10)9-3-5-12(17)13(18)7-9/h3,5,7,10-11,14-15H,4,6,8H2,1-2H3
n/an/a 2.47n/an/an/an/an/an/a
Organix Inc.
Curated by ChEMBL
Assay Description
Inhibition of [3H]citalopram binding to the serotonin transporter in rhesus (Macaca mulatta) or cynomolgus monkey (Macaca fascicularis) caudate-putam...
J Med Chem 44: 2619-35 (2001)
BindingDB Entry DOI: 10.7270/Q2K35VC3
Sodium-dependent dopamine transporter
(Homo sapiens (Human))
BDBM50035730
(3-(3,4-Dichloro-phenyl)-8-methyl-8-aza-bicyclo[3.2...)
Show SMILES COC(=O)C1C2CCC(CC1c1ccc(Cl)c(Cl)c1)N2C |TLB:20:19:4.10.9:6.7,THB:11:10:19:6.7,2:4:19:6.7|
Show InChI InChI=1S/C16H19Cl2NO2/c1-19-10-4-6-14(19)15(16(20)21-2)11(8-10)9-3-5-12(17)13(18)7-9/h3,5,7,10-11,14-15H,4,6,8H2,1-2H3
NCI pathway
Reactome pathway
n/an/a 0.380n/an/an/an/an/an/a
Organix Inc.
Curated by ChEMBL
Assay Description
Inhibition of [3H]WIN-35428 binding to Dopamine transporter in rhesus (Macaca mulatta) or cynomolgus monkey (Macaca fascicularis) caudate-putamen
J Med Chem 44: 2619-35 (2001)
BindingDB Entry DOI: 10.7270/Q2K35VC3
Sodium-dependent serotonin transporter
(Homo sapiens (Human))
BDBM50035730
(3-(3,4-Dichloro-phenyl)-8-methyl-8-aza-bicyclo[3.2...)
Show SMILES COC(=O)C1C2CCC(CC1c1ccc(Cl)c(Cl)c1)N2C |TLB:20:19:4.10.9:6.7,THB:11:10:19:6.7,2:4:19:6.7|
Show InChI InChI=1S/C16H19Cl2NO2/c1-19-10-4-6-14(19)15(16(20)21-2)11(8-10)9-3-5-12(17)13(18)7-9/h3,5,7,10-11,14-15H,4,6,8H2,1-2H3
n/an/a 27.7n/an/an/an/an/an/a
Organix Inc.
Curated by ChEMBL
Assay Description
Inhibition of [3H]citalopram binding to the serotonin transporter in rhesus (Macaca mulatta) or cynomolgus monkey (Macaca fascicularis) caudate-putam...
J Med Chem 44: 2619-35 (2001)
BindingDB Entry DOI: 10.7270/Q2K35VC3
Sodium-dependent serotonin transporter
(Homo sapiens (Human))
BDBM50035730
(3-(3,4-Dichloro-phenyl)-8-methyl-8-aza-bicyclo[3.2...)
Show SMILES COC(=O)C1C2CCC(CC1c1ccc(Cl)c(Cl)c1)N2C |TLB:20:19:4.10.9:6.7,THB:11:10:19:6.7,2:4:19:6.7|
Show InChI InChI=1S/C16H19Cl2NO2/c1-19-10-4-6-14(19)15(16(20)21-2)11(8-10)9-3-5-12(17)13(18)7-9/h3,5,7,10-11,14-15H,4,6,8H2,1-2H3
n/an/a 28n/an/an/an/an/an/a
Organix Inc
Curated by ChEMBL
Assay Description
Inhibition of [3H]WIN-35428 binding to dopamine transporter (DAT) of cynomolgus monkey caudate-putamen
Bioorg Med Chem Lett 9: 857-62 (1999)
BindingDB Entry DOI: 10.7270/Q26D5TGQ
Sodium-dependent serotonin transporter
(Homo sapiens (Human))
BDBM50035730
(3-(3,4-Dichloro-phenyl)-8-methyl-8-aza-bicyclo[3.2...)
Show SMILES COC(=O)C1C2CCC(CC1c1ccc(Cl)c(Cl)c1)N2C |TLB:20:19:4.10.9:6.7,THB:11:10:19:6.7,2:4:19:6.7|
Show InChI InChI=1S/C16H19Cl2NO2/c1-19-10-4-6-14(19)15(16(20)21-2)11(8-10)9-3-5-12(17)13(18)7-9/h3,5,7,10-11,14-15H,4,6,8H2,1-2H3
n/an/a 2.5n/an/an/an/an/an/a
Organix Inc.
Curated by ChEMBL
Assay Description
Inhibition of [3H]citalopram binding to the serotonin transporter (5-HT) in monkey caudate-putamen.
J Med Chem 40: 2661-73 (1997)
Article DOI: 10.1021/jm9703045
BindingDB Entry DOI: 10.7270/Q23T9HXJ