null
SMILES: Nc1nc(=O)n(cc1F)[C@H]1CS[C@@H](CO)C1
InChI Key: InChIKey=TXRGBWZGEKBGBX-PHDIDXHHSA-N
Activity Spreadsheet -- Enzyme Inhibition Constant Data from BindingDB
Found 1 hit for monomerid = 50035784
Trg + Lig
Ki
nM
ΔG°
kcal/mole
IC50
nM
Kd
nM
EC50/IC50
nM
koff
s-1
kon
M-1s-1
pHTemp
°C
Reverse transcriptase/RNaseH
(Human immunodeficiency virus 1)
BDBM50035784
(4-Amino-5-fluoro-1-((3R,5R)-5-hydroxymethyl-tetrah...)
Show SMILES Nc1nc(=O)n(cc1F)[C@H]1CS[C@@H](CO)C1
Show InChI InChI=1S/C9H12FN3O2S/c10-7-2-13(9(15)12-8(7)11)5-1-6(3-14)16-4-5/h2,5-6,14H,1,3-4H2,(H2,11,12,15)/t5-,6-/m1/s1
n/an/a 200n/an/an/an/an/an/a
BioChem Therapeutic Inc.
Curated by ChEMBL
Assay Description
Ability to inhibit the HIV-1 reverse transcriptase in cord blood mononuclear cells.
J Med Chem 38: 1-4 (1995)
BindingDB Entry DOI: 10.7270/Q2VD6XHP