null
SMILES: Nc1ccn([C@H]2CS[C@@H](CO)C2)c(=O)n1
InChI Key: InChIKey=VZFZUTKQULGQJM-RNFRBKRXSA-N
Activity Spreadsheet -- Enzyme Inhibition Constant Data from BindingDB
Found 1 hit for monomerid = 50035786
Trg + Lig
Ki
nM
ΔG°
kcal/mole
IC50
nM
Kd
nM
EC50/IC50
nM
koff
s-1
kon
M-1s-1
pHTemp
°C
Reverse transcriptase/RNaseH
(Human immunodeficiency virus 1)
BDBM50035786
(4-Amino-1-((3R,5R)-5-hydroxymethyl-tetrahydro-thio...)
Show SMILES Nc1ccn([C@H]2CS[C@@H](CO)C2)c(=O)n1
Show InChI InChI=1S/C9H13N3O2S/c10-8-1-2-12(9(14)11-8)6-3-7(4-13)15-5-6/h1-2,6-7,13H,3-5H2,(H2,10,11,14)/t6-,7-/m1/s1
n/an/a 355n/an/an/an/an/an/a
BioChem Therapeutic Inc.
Curated by ChEMBL
Assay Description
Ability to inhibit the HIV-1 reverse transcriptase in cord blood mononuclear cells.
J Med Chem 38: 1-4 (1995)
BindingDB Entry DOI: 10.7270/Q2VD6XHP