BDBM50036295 CHEMBL3353062
SMILES: ONC(=O)c1cc2CN(CCn2c1)C(=O)c1ccc(cc1)-c1ccccc1
InChI Key: InChIKey=KWSAEIUYNAKOEW-UHFFFAOYSA-N
Data: 1 IC50
Activity Spreadsheet -- Enzyme Inhibition Constant Data from BindingDB
Found 1 hit for monomerid = 50036295
Trg + Lig
Ki
nM
ΔG°
kcal/mole
IC50
nM
Kd
nM
EC50/IC50
nM
koff
s-1
kon
M-1s-1
pHTemp
°C
Cereblon/Histone deacetylase 6
(Homo sapiens (Human))
BDBM50036295
(CHEMBL3353062)
Show SMILES ONC(=O)c1cc2CN(CCn2c1)C(=O)c1ccc(cc1)-c1ccccc1
Show InChI InChI=1S/C21H19N3O3/c25-20(22-27)18-12-19-14-24(11-10-23(19)13-18)21(26)17-8-6-16(7-9-17)15-4-2-1-3-5-15/h1-9,12-13,27H,10-11,14H2,(H,22,25)
NCI pathway
Reactome pathway
n/an/a 32n/an/an/an/an/an/a
TBA
Curated by ChEMBL
Assay Description
Inhibition of recombinant N-GST-tagged HDAC6 (unknown origin) assessed as reduction in deacetylation of Ac-Arg-Gly-Lys(Ac)-AMC substrate by fluoresce...
Bioorg Med Chem Lett 24: 5450-4 (2015)
Article DOI: 10.1016/j.bmcl.2014.10.022
BindingDB Entry DOI: 10.7270/Q2B859QH