BDBM50036300 CHEMBL3353057
SMILES: COc1ccc(cc1)C(=O)N1CCn2cc(cc2C1)C(=O)NO
InChI Key: InChIKey=ZBYDKMSHGGWYID-UHFFFAOYSA-N
Data: 2 IC50
Activity Spreadsheet -- Enzyme Inhibition Constant Data from BindingDB
Found 2 hits for monomerid = 50036300
Trg + Lig
Ki
nM
ΔG°
kcal/mole
IC50
nM
Kd
nM
EC50/IC50
nM
koff
s-1
kon
M-1s-1
pHTemp
°C
Cereblon/Histone deacetylase 6
(Homo sapiens (Human))
BDBM50036300
(CHEMBL3353057)
Show SMILES COc1ccc(cc1)C(=O)N1CCn2cc(cc2C1)C(=O)NO
Show InChI InChI=1S/C16H17N3O4/c1-23-14-4-2-11(3-5-14)16(21)19-7-6-18-9-12(15(20)17-22)8-13(18)10-19/h2-5,8-9,22H,6-7,10H2,1H3,(H,17,20)
NCI pathway
Reactome pathway
n/an/a 100n/an/an/an/an/an/a
TBA
Curated by ChEMBL
Assay Description
Inhibition of HDAC6 in human HeLa cells assessed as reduction in K40 hyperacetylation of alpha-tubulin incubated for 6 hrs by immunofluorescence assa...
Bioorg Med Chem Lett 24: 5450-4 (2015)
Article DOI: 10.1016/j.bmcl.2014.10.022
BindingDB Entry DOI: 10.7270/Q2B859QH
Cereblon/Histone deacetylase 6
(Homo sapiens (Human))
BDBM50036300
(CHEMBL3353057)
Show SMILES COc1ccc(cc1)C(=O)N1CCn2cc(cc2C1)C(=O)NO
Show InChI InChI=1S/C16H17N3O4/c1-23-14-4-2-11(3-5-14)16(21)19-7-6-18-9-12(15(20)17-22)8-13(18)10-19/h2-5,8-9,22H,6-7,10H2,1H3,(H,17,20)
NCI pathway
Reactome pathway
n/an/a 43n/an/an/an/an/an/a
TBA
Curated by ChEMBL
Assay Description
Inhibition of recombinant N-GST-tagged HDAC6 (unknown origin) assessed as reduction in deacetylation of Ac-Arg-Gly-Lys(Ac)-AMC substrate by fluoresce...
Bioorg Med Chem Lett 24: 5450-4 (2015)
Article DOI: 10.1016/j.bmcl.2014.10.022
BindingDB Entry DOI: 10.7270/Q2B859QH