BDBM50036302 CHEMBL3353055
SMILES: ONC(=O)c1cc2CN(CCn2c1)C(=O)c1cccs1
InChI Key: InChIKey=CRVYDVAFHGWYCR-UHFFFAOYSA-N
Data: 1 IC50
Activity Spreadsheet -- Enzyme Inhibition Constant Data from BindingDB
Found 1 hit for monomerid = 50036302
Trg + Lig
Ki
nM
ΔG°
kcal/mole
IC50
nM
Kd
nM
EC50/IC50
nM
koff
s-1
kon
M-1s-1
pHTemp
°C
Cereblon/Histone deacetylase 6
(Homo sapiens (Human))
BDBM50036302
(CHEMBL3353055)
Show SMILES ONC(=O)c1cc2CN(CCn2c1)C(=O)c1cccs1
Show InChI InChI=1S/C13H13N3O3S/c17-12(14-19)9-6-10-8-16(4-3-15(10)7-9)13(18)11-2-1-5-20-11/h1-2,5-7,19H,3-4,8H2,(H,14,17)
NCI pathway
Reactome pathway
n/an/a 110n/an/an/an/an/an/a
TBA
Curated by ChEMBL
Assay Description
Inhibition of recombinant N-GST-tagged HDAC6 (unknown origin) assessed as reduction in deacetylation of Ac-Arg-Gly-Lys(Ac)-AMC substrate by fluoresce...
Bioorg Med Chem Lett 24: 5450-4 (2015)
Article DOI: 10.1016/j.bmcl.2014.10.022
BindingDB Entry DOI: 10.7270/Q2B859QH