BDBM50036423 CHEMBL164421::N-[4-(4-Hydroxy-3-isopropyl-phenoxy)-3,5-dimethyl-phenyl]-oxalamic acid benzyl ester
SMILES: CC(C)c1cc(Oc2c(C)cc(NC(=O)C(=O)OCc3ccccc3)cc2C)ccc1O
InChI Key: InChIKey=UHTHGQQXDMYMDC-UHFFFAOYSA-N
Data: 1 IC50
Activity Spreadsheet -- Enzyme Inhibition Constant Data from BindingDB
Found 1 hit for monomerid = 50036423
Trg + Lig
Ki
nM
ΔG°
kcal/mole
IC50
nM
Kd
nM
EC50/IC50
nM
koff
s-1
kon
M-1s-1
pHTemp
°C
thyroid beta
(RAT)
BDBM50036423
(CHEMBL164421 | N-[4-(4-Hydroxy-3-isopropyl-phenoxy...)
Show SMILES CC(C)c1cc(Oc2c(C)cc(NC(=O)C(=O)OCc3ccccc3)cc2C)ccc1O
Show InChI InChI=1S/C26H27NO5/c1-16(2)22-14-21(10-11-23(22)28)32-24-17(3)12-20(13-18(24)4)27-25(29)26(30)31-15-19-8-6-5-7-9-19/h5-14,16,28H,15H2,1-4H3,(H,27,29)
n/an/a 0.260n/an/an/an/an/an/a
Ciba Pharmaceuticals
Curated by ChEMBL
Assay Description
In vitro inhibition of the bound [125I]L-T3 rat liver nuclear L-triiodothyronine receptor
J Med Chem 38: 695-707 (1995)
BindingDB Entry DOI: 10.7270/Q2T43TRC