BDBM50036686 (E)-3-(3-Benzylsulfanylmethyl-4,5-dihydroxy-phenyl)-2-cyano-acrylamide::3-(3-Benzylsulfanylmethyl-4,5-dihydroxy-phenyl)-2-cyano-acrylamide::CHEMBL432428
SMILES: NC(=O)C(=C\c1cc(O)c(O)c(CSCc2ccccc2)c1)\C#N
InChI Key: InChIKey=JPNQHDIBDBJKGZ-MKMNVTDBSA-N
Data: 6 IC50
Activity Spreadsheet -- Enzyme Inhibition Constant Data from BindingDB
Found 6 hits for monomerid = 50036686
Trg + Lig
Ki
nM
ΔG°
kcal/mole
IC50
nM
Kd
nM
EC50/IC50
nM
koff
s-1
kon
M-1s-1
pHTemp
°C
Epidermal growth factor receptor
(Homo sapiens (Human))
BDBM50036686
((E)-3-(3-Benzylsulfanylmethyl-4,5-dihydroxy-phenyl...)
Show SMILES NC(=O)C(=C\c1cc(O)c(O)c(CSCc2ccccc2)c1)\C#N
Show InChI InChI=1S/C18H16N2O3S/c19-9-14(18(20)23)6-13-7-15(17(22)16(21)8-13)11-24-10-12-4-2-1-3-5-12/h1-8,21-22H,10-11H2,(H2,20,23)/b14-6+
n/an/a 940n/an/an/an/an/an/a
Hebrew University of Jerusalem
Curated by ChEMBL
Assay Description
Inhibition of HER-14 (human EGFR overexpressing NIH3T3) cell proliferation
J Med Chem 36: 3556-64 (1994)
BindingDB Entry DOI: 10.7270/Q2MP52B9
Epidermal growth factor receptor
(Homo sapiens (Human))
BDBM50036686
((E)-3-(3-Benzylsulfanylmethyl-4,5-dihydroxy-phenyl...)
Show SMILES NC(=O)C(=C\c1cc(O)c(O)c(CSCc2ccccc2)c1)\C#N
Show InChI InChI=1S/C18H16N2O3S/c19-9-14(18(20)23)6-13-7-15(17(22)16(21)8-13)11-24-10-12-4-2-1-3-5-12/h1-8,21-22H,10-11H2,(H2,20,23)/b14-6+
n/an/a 640n/an/an/an/an/an/a
Hebrew University of Jerusalem
Curated by ChEMBL
Assay Description
Inhibitiory concentration against EGF receptor by autophosphorylation
J Med Chem 36: 3556-64 (1994)
BindingDB Entry DOI: 10.7270/Q2MP52B9
Epidermal growth factor receptor and ErbB2 (HER1 and HER2)
(Homo sapiens (Human))
BDBM50036686
((E)-3-(3-Benzylsulfanylmethyl-4,5-dihydroxy-phenyl...)
Show SMILES NC(=O)C(=C\c1cc(O)c(O)c(CSCc2ccccc2)c1)\C#N
Show InChI InChI=1S/C18H16N2O3S/c19-9-14(18(20)23)6-13-7-15(17(22)16(21)8-13)11-24-10-12-4-2-1-3-5-12/h1-8,21-22H,10-11H2,(H2,20,23)/b14-6+
n/an/a 1.02E+3n/an/an/an/an/an/a
Hebrew University of Jerusalem
Curated by ChEMBL
Assay Description
Inhibitory concentration against ErbB2/neu (HER-2) by autophosphorylation
J Med Chem 36: 3556-64 (1994)
BindingDB Entry DOI: 10.7270/Q2MP52B9
Epidermal growth factor receptor
(Homo sapiens (Human))
BDBM50036686
((E)-3-(3-Benzylsulfanylmethyl-4,5-dihydroxy-phenyl...)
Show SMILES NC(=O)C(=C\c1cc(O)c(O)c(CSCc2ccccc2)c1)\C#N
Show InChI InChI=1S/C18H16N2O3S/c19-9-14(18(20)23)6-13-7-15(17(22)16(21)8-13)11-24-10-12-4-2-1-3-5-12/h1-8,21-22H,10-11H2,(H2,20,23)/b14-6+
n/an/a 646n/an/an/an/an/an/a
University of Tennessee Health Sciences Center
Curated by ChEMBL
Assay Description
Inhibitory activity against epidermal growth factor receptor (EGFR)
J Med Chem 46: 4657-68 (2003)
Article DOI: 10.1021/jm030065n
BindingDB Entry DOI: 10.7270/Q2N58NKR
Receptor tyrosine-protein kinase erbB-2
(Homo sapiens (Human))
BDBM50036686
((E)-3-(3-Benzylsulfanylmethyl-4,5-dihydroxy-phenyl...)
Show SMILES NC(=O)C(=C\c1cc(O)c(O)c(CSCc2ccccc2)c1)\C#N
Show InChI InChI=1S/C18H16N2O3S/c19-9-14(18(20)23)6-13-7-15(17(22)16(21)8-13)11-24-10-12-4-2-1-3-5-12/h1-8,21-22H,10-11H2,(H2,20,23)/b14-6+
n/an/a 1.02E+3n/an/an/an/an/an/a
University of Tennessee Health Sciences Center
Curated by ChEMBL
Assay Description
Inhibitory activity tested against protein kinase HER-2
J Med Chem 46: 4657-68 (2003)
Article DOI: 10.1021/jm030065n
BindingDB Entry DOI: 10.7270/Q2N58NKR
Epidermal growth factor receptor
(Homo sapiens (Human))
BDBM50036686
((E)-3-(3-Benzylsulfanylmethyl-4,5-dihydroxy-phenyl...)
Show SMILES NC(=O)C(=C\c1cc(O)c(O)c(CSCc2ccccc2)c1)\C#N
Show InChI InChI=1S/C18H16N2O3S/c19-9-14(18(20)23)6-13-7-15(17(22)16(21)8-13)11-24-10-12-4-2-1-3-5-12/h1-8,21-22H,10-11H2,(H2,20,23)/b14-6+
n/an/a 3.00E+3n/an/an/an/an/an/a
Hebrew University of Jerusalem
Curated by ChEMBL
Assay Description
Inhibitiory concentration against EGF receptor by autophosphorylation
J Med Chem 36: 3556-64 (1994)
BindingDB Entry DOI: 10.7270/Q2MP52B9