BDBM50036810 CHEMBL3355244
SMILES: CC(C)S(=O)(=O)c1c(Cl)ccc(Nc2nc(=O)cc([nH]2)C2CC(F)(F)C2)c1O
InChI Key: InChIKey=CFGBDSAPHMGQRL-UHFFFAOYSA-N
Data: 1 IC50
Activity Spreadsheet -- Enzyme Inhibition Constant Data from BindingDB
Found 1 hit for monomerid = 50036810
Trg + Lig
Ki
nM
ΔG°
kcal/mole
IC50
nM
Kd
nM
EC50/IC50
nM
koff
s-1
kon
M-1s-1
pHTemp
°C
C-X-C chemokine receptor type 2
(Homo sapiens (Human))
BDBM50036810
(CHEMBL3355244)
Show SMILES CC(C)S(=O)(=O)c1c(Cl)ccc(Nc2nc(=O)cc([nH]2)C2CC(F)(F)C2)c1O
Show InChI InChI=1S/C17H18ClF2N3O4S/c1-8(2)28(26,27)15-10(18)3-4-11(14(15)25)21-16-22-12(5-13(24)23-16)9-6-17(19,20)7-9/h3-5,8-9,25H,6-7H2,1-2H3,(H2,21,22,23,24)
Reactome pathway
n/an/a 631n/an/an/an/an/an/a
GlaxoSmithKline
Curated by ChEMBL
Assay Description
Antagonist activity at CXCR2 (unknown origin) by beta-arrestin assay
Bioorg Med Chem Lett 24: 5493-6 (2015)
Article DOI: 10.1016/j.bmcl.2014.10.003
BindingDB Entry DOI: 10.7270/Q21V5GKV