BDBM50037011 (2S,4S,5S)-5-{(S)-2-[(S)-1-Benzyl-2-(4-methoxymethoxy-piperidin-1-yl)-2-oxo-ethylamino]-hexanoylamino}-6-cyclohexyl-4-hydroxy-2-isopropyl-hexanoic acid [3-(2-hydroxy-ethylamino)-propyl]-amide::CHEMBL103905
SMILES: CCCC[C@H](N[C@@H](Cc1ccccc1)C(=O)N1CCC(CC1)OCOC)C(=O)N[C@@H](CC1CCCCC1)[C@@H](O)C[C@@H](C(C)C)C(=O)NCCCNCCO
InChI Key: InChIKey=XNHONUPMEWIJMK-MQDBWYGVSA-N
Data: 1 IC50
Activity Spreadsheet -- Enzyme Inhibition Constant Data from BindingDB
Found 1 hit for monomerid = 50037011
Trg + Lig
Ki
nM
ΔG°
kcal/mole
IC50
nM
Kd
nM
EC50/IC50
nM
koff
s-1
kon
M-1s-1
pHTemp
°C
Renin
(Homo sapiens (Human))
BDBM50037011
((2S,4S,5S)-5-{(S)-2-[(S)-1-Benzyl-2-(4-methoxymeth...)
Show SMILES CCCC[C@H](N[C@@H](Cc1ccccc1)C(=O)N1CCC(CC1)OCOC)C(=O)N[C@@H](CC1CCCCC1)[C@@H](O)C[C@@H](C(C)C)C(=O)NCCCNCCO
Show InChI InChI=1S/C42H73N5O7/c1-5-6-18-36(45-38(28-33-16-11-8-12-17-33)42(52)47-24-19-34(20-25-47)54-30-53-4)41(51)46-37(27-32-14-9-7-10-15-32)39(49)29-35(31(2)3)40(50)44-22-13-21-43-23-26-48/h8,11-12,16-17,31-32,34-39,43,45,48-49H,5-7,9-10,13-15,18-30H2,1-4H3,(H,44,50)(H,46,51)/t35-,36-,37-,38-,39-/m0/s1
Reactome pathway
n/an/a 7.90n/an/an/an/an/an/a
Abbott Laboratories
Curated by ChEMBL
Assay Description
Tested in vitro for its ability to inhibit the human plasma renin
J Med Chem 37: 2991-3007 (1994)
BindingDB Entry DOI: 10.7270/Q26H4GFS
3D
3D Structure (docked)