null
SMILES: CCCC[C@H](O[C@@H](Cc1ccccc1)C(=O)N1CCC(CC1)OCOC)C(=O)N[C@@H](CC1CCCCC1)[C@@H](O)C[C@@H](C(C)C)C(=O)NCCC(O)=O
InChI Key: InChIKey=CSGXCXQJLMSQFF-XYPUQJIVSA-N
Activity Spreadsheet -- Enzyme Inhibition Constant Data from BindingDB
Found 1 hit for monomerid = 50037015
Trg + Lig
Ki
nM
ΔG°
kcal/mole
IC50
nM
Kd
nM
EC50/IC50
nM
koff
s-1
kon
M-1s-1
pHTemp
°C
Renin
(Homo sapiens (Human))
BDBM50037015
(3-((2S,4S,5S)-5-{(S)-2-[(S)-1-Benzyl-2-(4-methoxym...)
Show SMILES CCCC[C@H](O[C@@H](Cc1ccccc1)C(=O)N1CCC(CC1)OCOC)C(=O)N[C@@H](CC1CCCCC1)[C@@H](O)C[C@@H](C(C)C)C(=O)NCCC(O)=O
Show InChI InChI=1S/C40H65N3O9/c1-5-6-17-35(52-36(25-30-15-11-8-12-16-30)40(49)43-22-19-31(20-23-43)51-27-50-4)39(48)42-33(24-29-13-9-7-10-14-29)34(44)26-32(28(2)3)38(47)41-21-18-37(45)46/h8,11-12,15-16,28-29,31-36,44H,5-7,9-10,13-14,17-27H2,1-4H3,(H,41,47)(H,42,48)(H,45,46)/t32-,33-,34-,35-,36-/m0/s1
Reactome pathway
n/an/a 6.80n/an/an/an/an/an/a
Abbott Laboratories
Curated by ChEMBL
Assay Description
Tested in vitro for its ability to inhibit the human plasma renin
J Med Chem 37: 2991-3007 (1994)
BindingDB Entry DOI: 10.7270/Q26H4GFS