BDBM50037018 (2S,4S,5S)-5-{(S)-2-[(S)-1-Benzyl-2-(4-methoxymethoxy-piperidin-1-yl)-2-oxo-ethylamino]-hexanoylamino}-6-cyclohexyl-4-hydroxy-2-isopropyl-hexanoic acid [2-(2-hydroxy-ethylamino)-2-methyl-propyl]-amide::CHEMBL100605
SMILES: CCCC[C@H](N[C@@H](Cc1ccccc1)C(=O)N1CCC(CC1)OCOC)C(=O)N[C@@H](CC1CCCCC1)[C@@H](O)C[C@@H](C(C)C)C(=O)NCC(C)(C)NCCO
InChI Key: InChIKey=MMQPVIUXDOTDEL-MQDBWYGVSA-N
Data: 1 IC50
Activity Spreadsheet -- Enzyme Inhibition Constant Data from BindingDB
Found 1 hit for monomerid = 50037018
Trg + Lig
Ki
nM
ΔG°
kcal/mole
IC50
nM
Kd
nM
EC50/IC50
nM
koff
s-1
kon
M-1s-1
pHTemp
°C
Renin
(Homo sapiens (Human))
BDBM50037018
((2S,4S,5S)-5-{(S)-2-[(S)-1-Benzyl-2-(4-methoxymeth...)
Show SMILES CCCC[C@H](N[C@@H](Cc1ccccc1)C(=O)N1CCC(CC1)OCOC)C(=O)N[C@@H](CC1CCCCC1)[C@@H](O)C[C@@H](C(C)C)C(=O)NCC(C)(C)NCCO
Show InChI InChI=1S/C43H75N5O7/c1-7-8-19-36(46-38(27-33-17-13-10-14-18-33)42(53)48-23-20-34(21-24-48)55-30-54-6)41(52)47-37(26-32-15-11-9-12-16-32)39(50)28-35(31(2)3)40(51)44-29-43(4,5)45-22-25-49/h10,13-14,17-18,31-32,34-39,45-46,49-50H,7-9,11-12,15-16,19-30H2,1-6H3,(H,44,51)(H,47,52)/t35-,36-,37-,38-,39-/m0/s1
Reactome pathway
n/an/a 6.30n/an/an/an/an/an/a
Abbott Laboratories
Curated by ChEMBL
Assay Description
Tested in vitro for its ability to inhibit the human plasma renin
J Med Chem 37: 2991-3007 (1994)
BindingDB Entry DOI: 10.7270/Q26H4GFS