BDBM50037076 CHEMBL3355737
SMILES: O[C@H]1CC[C@@H](CC1)Nc1cc(cc(Nc2cc([nH]n2)C2CCCC2)n1)S(=O)(=O)c1ccccc1
InChI Key:
Data: 1 KI  1 IC50
Activity Spreadsheet -- Enzyme Inhibition Constant Data from BindingDB
Found 2 hits for monomerid = 50037076
Trg + Lig
Ki
nM
ΔG°
kcal/mole
IC50
nM
Kd
nM
EC50/IC50
nM
koff
s-1
kon
M-1s-1
pHTemp
°C
Tyrosine-protein kinase ITK/TSK
(Homo sapiens (Human))
BDBM50037076
(CHEMBL3355737)
Show SMILES O[C@H]1CC[C@@H](CC1)Nc1cc(cc(Nc2cc([nH]n2)C2CCCC2)n1)S(=O)(=O)c1ccccc1 |r,wU:4.7,wD:1.0,(11.82,-31.11,;11.83,-29.57,;13.16,-28.8,;13.17,-27.26,;11.84,-26.5,;10.5,-27.26,;10.5,-28.8,;11.83,-24.96,;10.5,-24.19,;9.16,-24.96,;7.83,-24.19,;7.83,-22.65,;9.16,-21.88,;9.15,-20.34,;10.49,-19.56,;11.9,-20.19,;12.93,-19.05,;12.15,-17.72,;10.65,-18.04,;14.46,-19.19,;15.24,-20.52,;16.74,-20.2,;16.9,-18.67,;15.49,-18.04,;10.49,-22.64,;6.49,-24.96,;7.25,-26.29,;5.72,-26.28,;5.16,-24.19,;5.17,-22.65,;3.84,-21.88,;2.5,-22.65,;2.51,-24.2,;3.84,-24.96,)|
Reactome pathway
0.170n/an/an/an/an/an/an/an/a
Evotec UK Ltd
Curated by ChEMBL
Assay Description
Inhibition of GST-tagged full-length ITK (unknown origin) using Ac-EFPIYDFLPAKKK-NH2 as substrate after 35 mins by LC/MS analysis
Bioorg Med Chem Lett 24: 5818-23 (2014)
Article DOI: 10.1016/j.bmcl.2014.10.020
BindingDB Entry DOI: 10.7270/Q2NK3GNT
Phospholipase C-gamma-1
(Homo sapiens (Human))
BDBM50037076
(CHEMBL3355737)
Show SMILES O[C@H]1CC[C@@H](CC1)Nc1cc(cc(Nc2cc([nH]n2)C2CCCC2)n1)S(=O)(=O)c1ccccc1 |r,wU:4.7,wD:1.0,(11.82,-31.11,;11.83,-29.57,;13.16,-28.8,;13.17,-27.26,;11.84,-26.5,;10.5,-27.26,;10.5,-28.8,;11.83,-24.96,;10.5,-24.19,;9.16,-24.96,;7.83,-24.19,;7.83,-22.65,;9.16,-21.88,;9.15,-20.34,;10.49,-19.56,;11.9,-20.19,;12.93,-19.05,;12.15,-17.72,;10.65,-18.04,;14.46,-19.19,;15.24,-20.52,;16.74,-20.2,;16.9,-18.67,;15.49,-18.04,;10.49,-22.64,;6.49,-24.96,;7.25,-26.29,;5.72,-26.28,;5.16,-24.19,;5.17,-22.65,;3.84,-21.88,;2.5,-22.65,;2.51,-24.2,;3.84,-24.96,)|
NCI pathway
Reactome pathway
n/an/a 180n/an/an/an/an/an/a
Evotec UK Ltd
Curated by ChEMBL
Assay Description
Inhibition of PLC gamma-1 phosphorylation in human Jurkat T cells after 30 mins
Bioorg Med Chem Lett 24: 5818-23 (2014)
Article DOI: 10.1016/j.bmcl.2014.10.020
BindingDB Entry DOI: 10.7270/Q2NK3GNT