BDBM50037131 (4aR,7S,7aR,12bS)-3-Cyclopropylmethyl-2,3,4,4a,5,6,7,7a-octahydro-1H-8-oxa-3-aza-benzo[d]fluorene-7,9-diol::CHEMBL319236
SMILES: O[C@H]1CC[C@H]2CN(CC3CC3)CC[C@]22[C@H]1Oc1c2cccc1O
InChI Key: InChIKey=KTXMLKWFHNEBJM-FDARSICLSA-N
Data: 4 KI
Activity Spreadsheet -- Enzyme Inhibition Constant Data from BindingDB
Found 4 hits for monomerid = 50037131
Trg + Lig
Ki
nM
ΔG°
kcal/mole
IC50
nM
Kd
nM
EC50/IC50
nM
koff
s-1
kon
M-1s-1
pHTemp
°C
Mu-type opioid receptor
(GUINEA PIG)
BDBM50037131
((4aR,7S,7aR,12bS)-3-Cyclopropylmethyl-2,3,4,4a,5,6...)
Show SMILES O[C@H]1CC[C@H]2CN(CC3CC3)CC[C@]22[C@H]1Oc1c2cccc1O
Show InChI InChI=1S/C19H25NO3/c21-15-3-1-2-14-17(15)23-18-16(22)7-6-13-11-20(10-12-4-5-12)9-8-19(13,14)18/h1-3,12-13,16,18,21-22H,4-11H2/t13-,16-,18-,19-/m0/s1
1.40n/an/an/an/an/an/an/an/a
National Taiwan University
Curated by ChEMBL
Assay Description
In vivo binding affinity against mu opioid receptor was measured by using labeled ligand [3H]-Naloxone (0.5 nM)
J Med Chem 37: 3121-7 (1994)
BindingDB Entry DOI: 10.7270/Q2PK0F6R
Kappa-type opioid receptor
(Cavia porcellus (domestic guinea pig))
BDBM50037131
((4aR,7S,7aR,12bS)-3-Cyclopropylmethyl-2,3,4,4a,5,6...)
Show SMILES O[C@H]1CC[C@H]2CN(CC3CC3)CC[C@]22[C@H]1Oc1c2cccc1O
Show InChI InChI=1S/C19H25NO3/c21-15-3-1-2-14-17(15)23-18-16(22)7-6-13-11-20(10-12-4-5-12)9-8-19(13,14)18/h1-3,12-13,16,18,21-22H,4-11H2/t13-,16-,18-,19-/m0/s1
4.90n/an/an/an/an/an/an/an/a
National Taiwan University
Curated by ChEMBL
Assay Description
In vivo binding affinity against kappa opioid receptor was measured by using labeled ligand [3H]-ethylketocyclazocine (1 nM) with 500 nM DADLE and 20...
J Med Chem 37: 3121-7 (1994)
BindingDB Entry DOI: 10.7270/Q2PK0F6R
Delta-type opioid receptor
(Homo sapiens (Human))
BDBM50037131
((4aR,7S,7aR,12bS)-3-Cyclopropylmethyl-2,3,4,4a,5,6...)
Show SMILES O[C@H]1CC[C@H]2CN(CC3CC3)CC[C@]22[C@H]1Oc1c2cccc1O
Show InChI InChI=1S/C19H25NO3/c21-15-3-1-2-14-17(15)23-18-16(22)7-6-13-11-20(10-12-4-5-12)9-8-19(13,14)18/h1-3,12-13,16,18,21-22H,4-11H2/t13-,16-,18-,19-/m0/s1
Reactome pathway
15n/an/an/an/an/an/an/an/a
National Taiwan University
Curated by ChEMBL
Assay Description
In vivo binding affinity against delta Opioid receptor was measured by using labeled ligand [3H]-DADLE (1 nM) with 4 nM sufentanil
J Med Chem 37: 3121-7 (1994)
BindingDB Entry DOI: 10.7270/Q2PK0F6R
Sigma non-opioid intracellular receptor 1
(Homo sapiens (Human))
BDBM50037131
((4aR,7S,7aR,12bS)-3-Cyclopropylmethyl-2,3,4,4a,5,6...)
Show SMILES O[C@H]1CC[C@H]2CN(CC3CC3)CC[C@]22[C@H]1Oc1c2cccc1O
Show InChI InChI=1S/C19H25NO3/c21-15-3-1-2-14-17(15)23-18-16(22)7-6-13-11-20(10-12-4-5-12)9-8-19(13,14)18/h1-3,12-13,16,18,21-22H,4-11H2/t13-,16-,18-,19-/m0/s1
580n/an/an/an/an/an/an/an/a
National Taiwan University
Curated by ChEMBL
Assay Description
In vivo binding affinity against sigma Opioid receptor was measured by using labeled ligand [3H]-SKF- 10,047 (1 nM)
J Med Chem 37: 3121-7 (1994)
BindingDB Entry DOI: 10.7270/Q2PK0F6R