BDBM50037622 1-[5-(4,5-Diphenyl-1H-imidazol-2-ylsulfanyl)-pentyl]-1-heptyl-3-propyl-urea::CHEMBL119678
SMILES: CCCCCCCN(CCCCCSc1nc(c([nH]1)-c1ccccc1)-c1ccccc1)C(=O)NCCC
InChI Key: InChIKey=ZNCZNPQDYUXVRR-UHFFFAOYSA-N
Data: 1 IC50
Activity Spreadsheet -- Enzyme Inhibition Constant Data from BindingDB
Found 1 hit for monomerid = 50037622
Trg + Lig
Ki
nM
ΔG°
kcal/mole
IC50
nM
Kd
nM
EC50/IC50
nM
koff
s-1
kon
M-1s-1
pHTemp
°C
Sterol O-acyltransferase, Soat
(Rattus norvegicus)
BDBM50037622
(1-[5-(4,5-Diphenyl-1H-imidazol-2-ylsulfanyl)-penty...)
Show SMILES CCCCCCCN(CCCCCSc1nc(c([nH]1)-c1ccccc1)-c1ccccc1)C(=O)NCCC
Show InChI InChI=1S/C31H44N4OS/c1-3-5-6-7-15-23-35(31(36)32-22-4-2)24-16-10-17-25-37-30-33-28(26-18-11-8-12-19-26)29(34-30)27-20-13-9-14-21-27/h8-9,11-14,18-21H,3-7,10,15-17,22-25H2,1-2H3,(H,32,36)(H,33,34)
n/an/a 10n/an/an/an/an/an/a
DuPont Merck Research Laboratories
Curated by ChEMBL
Assay Description
In vitro inhibition of Acyl coenzyme A:cholesterol acyltransferase in rat hepatic microsomes
J Med Chem 37: 3511-22 (1994)
BindingDB Entry DOI: 10.7270/Q2MK6BXK