null
SMILES: C(C1CCC=C(C1)c1ccccc1)N1CCN(CC1)c1ncccn1
InChI Key: InChIKey=LZUOLMQBKILJRQ-UHFFFAOYSA-N
Activity Spreadsheet -- Enzyme Inhibition Constant Data from BindingDB
Found 1 hit for monomerid = 50037667
Trg + Lig
Ki
nM
ΔG°
kcal/mole
IC50
nM
Kd
nM
EC50/IC50
nM
koff
s-1
kon
M-1s-1
pHTemp
°C
D(2) dopamine receptor
(Rattus norvegicus (rat))
BDBM50037667
(2-[4-(3-Phenyl-cyclohex-3-enylmethyl)-piperazin-1-...)
Show SMILES C(C1CCC=C(C1)c1ccccc1)N1CCN(CC1)c1ncccn1 |c:4|
Show InChI InChI=1S/C21H26N4/c1-2-7-19(8-3-1)20-9-4-6-18(16-20)17-24-12-14-25(15-13-24)21-22-10-5-11-23-21/h1-3,5,7-11,18H,4,6,12-17H2
Reactome pathway
n/an/a 354n/an/an/an/an/an/a
Parke-Davis Pharmaceutical Research
Curated by ChEMBL
Assay Description
In vitro inhibition of [3H]-spiperone binding to Dopamine D2 receptor in rat striatum.
J Med Chem 37: 3523-33 (1994)
BindingDB Entry DOI: 10.7270/Q2GT5M68