null
SMILES: C1CC(CC(=C1)c1ccccc1)N1CCC(=CC1)c1ccccc1
InChI Key: InChIKey=KYNACDPIFPBEAN-UHFFFAOYSA-N
Activity Spreadsheet -- Enzyme Inhibition Constant Data from BindingDB
Found 1 hit for monomerid = 50037677
Trg + Lig
Ki
nM
ΔG°
kcal/mole
IC50
nM
Kd
nM
EC50/IC50
nM
koff
s-1
kon
M-1s-1
pHTemp
°C
D(2) dopamine receptor
(Rattus norvegicus (rat))
BDBM50037677
(4-Phenyl-1-(3-phenyl-cyclohex-3-enyl)-1,2,3,6-tetr...)
Show SMILES C1CC(CC(=C1)c1ccccc1)N1CCC(=CC1)c1ccccc1 |c:4,17|
Show InChI InChI=1S/C23H25N/c1-3-8-19(9-4-1)21-14-16-24(17-15-21)23-13-7-12-22(18-23)20-10-5-2-6-11-20/h1-6,8-12,14,23H,7,13,15-18H2
Reactome pathway
n/an/a 9.21E+3n/an/an/an/an/an/a
Parke-Davis Pharmaceutical Research
Curated by ChEMBL
Assay Description
In vitro inhibition of [3H]-spiperone binding to Dopamine D2 receptor in rat striatum.
J Med Chem 37: 3523-33 (1994)
BindingDB Entry DOI: 10.7270/Q2GT5M68