BDBM50037934 (4aR,6aR)-7-(1,5-Dimethyl-hexyl)-1,4a,6a-trimethyl-1,3,4,4a,4b,5,6,6a,7,8,9,9a,9b,10-tetradecahydro-indeno[5,4-f]quinolin-2-one::CHEMBL125855
SMILES: CC(C)CCCC(C)C1CCC2C3CC=C4N(C)C(=O)CC[C@]4(C)C3CC[C@]12C
InChI Key: InChIKey=MQJFLUWTYLLCEZ-WXCGXNTQSA-N
Data: 1 IC50
Activity Spreadsheet -- Enzyme Inhibition Constant Data from BindingDB
Found 1 hit for monomerid = 50037934
Trg + Lig
Ki
nM
ΔG°
kcal/mole
IC50
nM
Kd
nM
EC50/IC50
nM
koff
s-1
kon
M-1s-1
pHTemp
°C
5α-Reductase 1 (5α-R1)
(Homo sapiens (Human))
BDBM50037934
((4aR,6aR)-7-(1,5-Dimethyl-hexyl)-1,4a,6a-trimethyl...)
Show SMILES CC(C)CCCC(C)C1CCC2C3CC=C4N(C)C(=O)CC[C@]4(C)C3CC[C@]12C |t:14|
Show InChI InChI=1S/C27H45NO/c1-18(2)8-7-9-19(3)21-11-12-22-20-10-13-24-27(5,17-15-25(29)28(24)6)23(20)14-16-26(21,22)4/h13,18-23H,7-12,14-17H2,1-6H3/t19?,20?,21?,22?,23?,26-,27-/m1/s1
n/an/a 4.30n/an/an/an/an/an/a
Merck Research Laboratories
Curated by ChEMBL
Assay Description
Inhibition of type 1 steroid-5-alpha-reductase
J Med Chem 37: 3871-4 (1994)
BindingDB Entry DOI: 10.7270/Q2K35V8R