BDBM50038881 CHEMBL294803::Y-29794::[2-(8-Dimethylamino-octylsulfanyl)-6-isopropyl-pyridin-3-yl]-thiophen-2-yl-methanone
SMILES: CC(C)c1ccc(C(=O)c2cccs2)c(SCCCCCCCCN(C)C)n1
InChI Key: InChIKey=HAGHKJDWBDSFKC-UHFFFAOYSA-N
Data: 1 KI  1 IC50
Activity Spreadsheet -- Enzyme Inhibition Constant Data from BindingDB
Found 2 hits for monomerid = 50038881
Trg + Lig
Ki
nM
ΔG°
kcal/mole
IC50
nM
Kd
nM
EC50/IC50
nM
koff
s-1
kon
M-1s-1
pHTemp
°C
Prolyl endopeptidase
(Rattus norvegicus)
BDBM50038881
(CHEMBL294803 | Y-29794 | [2-(8-Dimethylamino-octyl...)
Show SMILES CC(C)c1ccc(C(=O)c2cccs2)c(SCCCCCCCCN(C)C)n1
Show InChI InChI=1S/C23H34N2OS2/c1-18(2)20-14-13-19(22(26)21-12-11-17-27-21)23(24-20)28-16-10-8-6-5-7-9-15-25(3)4/h11-14,17-18H,5-10,15-16H2,1-4H3
0.950n/an/an/an/an/an/an/an/a
McGill University
Curated by ChEMBL
Assay Description
Inhibition of POP in rat brain homogenate
J Med Chem 53: 3423-38 (2010)
Article DOI: 10.1021/jm901104g
BindingDB Entry DOI: 10.7270/Q261119N
Prolyl endopeptidase
(Homo sapiens (Human))
BDBM50038881
(CHEMBL294803 | Y-29794 | [2-(8-Dimethylamino-octyl...)
Show SMILES CC(C)c1ccc(C(=O)c2cccs2)c(SCCCCCCCCN(C)C)n1
Show InChI InChI=1S/C23H34N2OS2/c1-18(2)20-14-13-19(22(26)21-12-11-17-27-21)23(24-20)28-16-10-8-6-5-7-9-15-25(3)4/h11-14,17-18H,5-10,15-16H2,1-4H3
n/an/a 3.50E+3n/an/an/an/an/an/a
Zeria Pharmaceutical Company, Ltd.
Curated by ChEMBL
Assay Description
In vitro inhibitory activity against purified prolyl endopeptidase (PEP) from canine brain.
J Med Chem 37: 2071-8 (1994)
BindingDB Entry DOI: 10.7270/Q270822J