BDBM50038889 (S)-1-((S)-1-(2-(2,3-dihydro-1H-inden-2-yl)acetyl)pyrrolidine-2-carbonyl)pyrrolidine-2-carbonitrile::(S)-1-[(S)-1-(2-Indan-2-yl-acetyl)-pyrrolidine-2-carbonyl]-pyrrolidine-2-carbonitrile::CHEMBL62580
SMILES: O=C(CC1Cc2ccccc2C1)N1CCC[C@H]1C(=O)N1CCC[C@H]1C#N
InChI Key: InChIKey=BPDMDQAKGPKONQ-OALUTQOASA-N
Data: 1 IC50
Activity Spreadsheet -- Enzyme Inhibition Constant Data from BindingDB
Found 1 hit for monomerid = 50038889
Trg + Lig
Ki
nM
ΔG°
kcal/mole
IC50
nM
Kd
nM
EC50/IC50
nM
koff
s-1
kon
M-1s-1
pHTemp
°C
Prolyl endopeptidase
(Homo sapiens (Human))
BDBM50038889
((S)-1-((S)-1-(2-(2,3-dihydro-1H-inden-2-yl)acetyl)...)
Show SMILES O=C(CC1Cc2ccccc2C1)N1CCC[C@H]1C(=O)N1CCC[C@H]1C#N
Show InChI InChI=1S/C21H25N3O2/c22-14-18-7-3-9-23(18)21(26)19-8-4-10-24(19)20(25)13-15-11-16-5-1-2-6-17(16)12-15/h1-2,5-6,15,18-19H,3-4,7-13H2/t18-,19-/m0/s1
n/an/a 1.20n/an/an/an/an/an/a
Zeria Pharmaceutical Company, Ltd.
Curated by ChEMBL
Assay Description
In vitro inhibitory activity against purified prolyl endopeptidase (PEP) from canine brain.
J Med Chem 37: 2071-8 (1994)
BindingDB Entry DOI: 10.7270/Q270822J