null
SMILES: Clc1ccc(CC(=O)N2CCc3occc3C2CN2CCC(=O)C2)cc1Cl
InChI Key: InChIKey=AJKUPPVEURAWOP-UHFFFAOYSA-N
Activity Spreadsheet -- Enzyme Inhibition Constant Data from BindingDB
Found 1 hit for monomerid = 50039099
Trg + Lig
Ki
nM
ΔG°
kcal/mole
IC50
nM
Kd
nM
EC50/IC50
nM
koff
s-1
kon
M-1s-1
pHTemp
°C
Kappa-type opioid receptor
(Homo sapiens (Human))
BDBM50039099
(1-{5-[2-(3,4-Dichloro-phenyl)-acetyl]-4,5,6,7-tetr...)
Show SMILES Clc1ccc(CC(=O)N2CCc3occc3C2CN2CCC(=O)C2)cc1Cl
Show InChI InChI=1S/C20H20Cl2N2O3/c21-16-2-1-13(9-17(16)22)10-20(26)24-7-4-19-15(5-8-27-19)18(24)12-23-6-3-14(25)11-23/h1-2,5,8-9,18H,3-4,6-7,10-12H2
Reactome pathway
n/an/a 6n/an/an/an/an/an/a
Glaxo Group Research Ltd.
Curated by ChEMBL
Assay Description
In vitro kappa-opioid receptor agonist activity in isolated rabbit vas deferens assay
J Med Chem 37: 2138-44 (1994)
BindingDB Entry DOI: 10.7270/Q2668C78