BDBM50039509 (R)-2-[(1-Mercaptomethyl-cyclopentanecarbonyl)-amino]-4-methylsulfanyl-butyric acid::CHEMBL79860
SMILES: CSCC[C@@H](NC(=O)C1(CS)CCCC1)C(O)=O
InChI Key: InChIKey=HNVWSNMGQQKFFV-SECBINFHSA-N
Data: 2 IC50
Activity Spreadsheet -- Enzyme Inhibition Constant Data from BindingDB
Found 2 hits for monomerid = 50039509
Trg + Lig
Ki
nM
ΔG°
kcal/mole
IC50
nM
Kd
nM
EC50/IC50
nM
koff
s-1
kon
M-1s-1
pHTemp
°C
Neprilysin
(Oryctolagus cuniculus (rabbit))
BDBM50039509
((R)-2-[(1-Mercaptomethyl-cyclopentanecarbonyl)-ami...)
Show SMILES CSCC[C@@H](NC(=O)C1(CS)CCCC1)C(O)=O
Show InChI InChI=1S/C12H21NO3S2/c1-18-7-4-9(10(14)15)13-11(16)12(8-17)5-2-3-6-12/h9,17H,2-8H2,1H3,(H,13,16)(H,14,15)/t9-/m1/s1
n/an/a 3.5n/an/an/an/an/an/a
Schering-Plough Research Institute
Curated by ChEMBL
Assay Description
In vitro inhibitory activity against neutral endopeptidase (NEP)
J Med Chem 37: 2461-76 (1994)
BindingDB Entry DOI: 10.7270/Q2571B20
Angiotensin-converting enzyme
(Oryctolagus cuniculus)
BDBM50039509
((R)-2-[(1-Mercaptomethyl-cyclopentanecarbonyl)-ami...)
Show SMILES CSCC[C@@H](NC(=O)C1(CS)CCCC1)C(O)=O
Show InChI InChI=1S/C12H21NO3S2/c1-18-7-4-9(10(14)15)13-11(16)12(8-17)5-2-3-6-12/h9,17H,2-8H2,1H3,(H,13,16)(H,14,15)/t9-/m1/s1
n/an/a 700n/an/an/an/an/an/a
Schering-Plough Research Institute
Curated by ChEMBL
Assay Description
Tested in vitro for its inhibitory activity against angiotensin converting enzyme
J Med Chem 37: 2461-76 (1994)
BindingDB Entry DOI: 10.7270/Q2571B20