BDBM50039518 (S)-3-Benzylsulfanyl-2-((S)-3-mercapto-2-methyl-propionylamino)-propionic acid::CHEMBL79333
SMILES: C[C@H](CS)C(=O)N[C@H](CSCc1ccccc1)C(O)=O
InChI Key: InChIKey=BWBMGYXXENMIJX-ZYHUDNBSSA-N
Data: 2 IC50
Activity Spreadsheet -- Enzyme Inhibition Constant Data from BindingDB
Found 2 hits for monomerid = 50039518
Trg + Lig
Ki
nM
ΔG°
kcal/mole
IC50
nM
Kd
nM
EC50/IC50
nM
koff
s-1
kon
M-1s-1
pHTemp
°C
Neprilysin
(Oryctolagus cuniculus (rabbit))
BDBM50039518
((S)-3-Benzylsulfanyl-2-((S)-3-mercapto-2-methyl-pr...)
Show SMILES C[C@H](CS)C(=O)N[C@H](CSCc1ccccc1)C(O)=O
Show InChI InChI=1S/C14H19NO3S2/c1-10(7-19)13(16)15-12(14(17)18)9-20-8-11-5-3-2-4-6-11/h2-6,10,12,19H,7-9H2,1H3,(H,15,16)(H,17,18)/t10-,12-/m1/s1
n/an/a 46n/an/an/an/an/an/a
Schering-Plough Research Institute
Curated by ChEMBL
Assay Description
In vitro inhibitory activity against neutral endopeptidase (NEP)
J Med Chem 37: 2461-76 (1994)
BindingDB Entry DOI: 10.7270/Q2571B20
Angiotensin-converting enzyme
(Oryctolagus cuniculus)
BDBM50039518
((S)-3-Benzylsulfanyl-2-((S)-3-mercapto-2-methyl-pr...)
Show SMILES C[C@H](CS)C(=O)N[C@H](CSCc1ccccc1)C(O)=O
Show InChI InChI=1S/C14H19NO3S2/c1-10(7-19)13(16)15-12(14(17)18)9-20-8-11-5-3-2-4-6-11/h2-6,10,12,19H,7-9H2,1H3,(H,15,16)(H,17,18)/t10-,12-/m1/s1
n/an/a 58n/an/an/an/an/an/a
Schering-Plough Research Institute
Curated by ChEMBL
Assay Description
Tested in vitro for its inhibitory activity against angiotensin converting enzyme
J Med Chem 37: 2461-76 (1994)
BindingDB Entry DOI: 10.7270/Q2571B20