BDBM50039662 CHEMBL3357342
SMILES: CN1CCN(CC1)c1nc(C)nc2n(CC(C)(C)O)c(nc12)-c1ccccc1Cl
InChI Key: InChIKey=YFTCLNZWBGCELR-UHFFFAOYSA-N
Data: 2 EC50
Activity Spreadsheet -- Enzyme Inhibition Constant Data from BindingDB
Found 2 hits for monomerid = 50039662
Trg + Lig
Ki
nM
ΔG°
kcal/mole
IC50
nM
Kd
nM
EC50/IC50
nM
koff
s-1
kon
M-1s-1
pHTemp
°C
Cannabinoid receptor 2
(Homo sapiens (Human))
BDBM50039662
(CHEMBL3357342)
Show SMILES CN1CCN(CC1)c1nc(C)nc2n(CC(C)(C)O)c(nc12)-c1ccccc1Cl
Show InChI InChI=1S/C21H27ClN6O/c1-14-23-19(27-11-9-26(4)10-12-27)17-20(24-14)28(13-21(2,3)29)18(25-17)15-7-5-6-8-16(15)22/h5-8,29H,9-13H2,1-4H3
Reactome pathway
n/an/an/an/a 5.90n/an/an/an/a
Lilly Research Laboratories
Curated by ChEMBL
Assay Description
Agonist activity at human CB2 receptor expressed in CHO cells by [35S]-GTPgammaS binding assay
Bioorg Med Chem Lett 24: 5572-5 (2014)
Article DOI: 10.1016/j.bmcl.2014.11.006
BindingDB Entry DOI: 10.7270/Q2R78GVW
Cannabinoid receptor 1
(Homo sapiens (Human))
BDBM50039662
(CHEMBL3357342)
Show SMILES CN1CCN(CC1)c1nc(C)nc2n(CC(C)(C)O)c(nc12)-c1ccccc1Cl
Show InChI InChI=1S/C21H27ClN6O/c1-14-23-19(27-11-9-26(4)10-12-27)17-20(24-14)28(13-21(2,3)29)18(25-17)15-7-5-6-8-16(15)22/h5-8,29H,9-13H2,1-4H3
NCI pathway
Reactome pathway
n/an/an/an/a>1.00E+5n/an/an/an/a
Lilly Research Laboratories
Curated by ChEMBL
Assay Description
Agonist activity at human CB1 receptor expressed in Sf9 cells by [35S]-GTPgammaS binding assay
Bioorg Med Chem Lett 24: 5572-5 (2014)
Article DOI: 10.1016/j.bmcl.2014.11.006
BindingDB Entry DOI: 10.7270/Q2R78GVW