BDBM50039870 4'-[3-Butyl-5-oxo-1-(2-trifluoromethyl-phenyl)-1,5-dihydro-[1,2,4]triazol-4-ylmethyl]-biphenyl-2-sulfonic acid (2,2-dichloro-1-methyl-cyclopropanecarbonyl)-amide::CHEMBL328434
SMILES: CCCCc1nn(-c2ccccc2C(F)(F)F)c(=O)n1Cc1ccc(cc1)-c1ccccc1S(=O)(=O)NC(=O)C1(C)CC1(Cl)Cl
InChI Key: InChIKey=RKRHFJADZOJHBH-UHFFFAOYSA-N
Data: 2 IC50
Activity Spreadsheet -- Enzyme Inhibition Constant Data from BindingDB
Found 2 hits for monomerid = 50039870
Trg + Lig
Ki
nM
ΔG°
kcal/mole
IC50
nM
Kd
nM
EC50/IC50
nM
koff
s-1
kon
M-1s-1
pHTemp
°C
Angiotensin II AT2
(RAT)
BDBM50039870
(4'-[3-Butyl-5-oxo-1-(2-trifluoromethyl-phenyl)-1,5...)
Show SMILES CCCCc1nn(-c2ccccc2C(F)(F)F)c(=O)n1Cc1ccc(cc1)-c1ccccc1S(=O)(=O)NC(=O)C1(C)CC1(Cl)Cl
Show InChI InChI=1S/C31H29Cl2F3N4O4S/c1-3-4-13-26-37-40(24-11-7-6-10-23(24)31(34,35)36)28(42)39(26)18-20-14-16-21(17-15-20)22-9-5-8-12-25(22)45(43,44)38-27(41)29(2)19-30(29,32)33/h5-12,14-17H,3-4,13,18-19H2,1-2H3,(H,38,41)
n/an/a 120n/an/an/an/an/an/a
Merck Research Laboratories
Curated by ChEMBL
Assay Description
In vitro inhibitory activity against angiotensin II rat midbrain AT2 receptor using radioligand [125I]-Sar Ile-AII
J Med Chem 37: 2808-24 (1994)
BindingDB Entry DOI: 10.7270/Q2M907QM
Angiotensin II type 1a (AT-1a) receptor
(RABBIT)
BDBM50039870
(4'-[3-Butyl-5-oxo-1-(2-trifluoromethyl-phenyl)-1,5...)
Show SMILES CCCCc1nn(-c2ccccc2C(F)(F)F)c(=O)n1Cc1ccc(cc1)-c1ccccc1S(=O)(=O)NC(=O)C1(C)CC1(Cl)Cl
Show InChI InChI=1S/C31H29Cl2F3N4O4S/c1-3-4-13-26-37-40(24-11-7-6-10-23(24)31(34,35)36)28(42)39(26)18-20-14-16-21(17-15-20)22-9-5-8-12-25(22)45(43,44)38-27(41)29(2)19-30(29,32)33/h5-12,14-17H,3-4,13,18-19H2,1-2H3,(H,38,41)
n/an/a 0.370n/an/an/an/an/an/a
Merck Research Laboratories
Curated by ChEMBL
Assay Description
In vitro inhibitory activity against angiotensin II rabbit aorta AT1 receptor using radioligand [125I]-Sar Ile-AII
J Med Chem 37: 2808-24 (1994)
BindingDB Entry DOI: 10.7270/Q2M907QM