BDBM50039904 4'-[3-Butyl-5-oxo-1-(2-trifluoromethyl-phenyl)-1,5-dihydro-[1,2,4]triazol-4-ylmethyl]-biphenyl-2-sulfonic acid cycloheptanecarbonyl-amide::CHEMBL329099
SMILES: CCCCc1nn(-c2ccccc2C(F)(F)F)c(=O)n1Cc1ccc(cc1)-c1ccccc1S(=O)(=O)NC(=O)C1CCCCCC1
InChI Key: InChIKey=FTJIFYIITVETKU-UHFFFAOYSA-N
Data: 2 IC50
Activity Spreadsheet -- Enzyme Inhibition Constant Data from BindingDB
Found 2 hits for monomerid = 50039904
Trg + Lig
Ki
nM
ΔG°
kcal/mole
IC50
nM
Kd
nM
EC50/IC50
nM
koff
s-1
kon
M-1s-1
pHTemp
°C
Angiotensin II AT2
(RAT)
BDBM50039904
(4'-[3-Butyl-5-oxo-1-(2-trifluoromethyl-phenyl)-1,5...)
Show SMILES CCCCc1nn(-c2ccccc2C(F)(F)F)c(=O)n1Cc1ccc(cc1)-c1ccccc1S(=O)(=O)NC(=O)C1CCCCCC1
Show InChI InChI=1S/C34H37F3N4O4S/c1-2-3-18-31-38-41(29-16-10-9-15-28(29)34(35,36)37)33(43)40(31)23-24-19-21-25(22-20-24)27-14-8-11-17-30(27)46(44,45)39-32(42)26-12-6-4-5-7-13-26/h8-11,14-17,19-22,26H,2-7,12-13,18,23H2,1H3,(H,39,42)
n/an/a 270n/an/an/an/an/an/a
Merck Research Laboratories
Curated by ChEMBL
Assay Description
In vitro inhibitory activity against angiotensin II rat midbrain AT2 receptor using radioligand [125I]-Sar Ile-AII
J Med Chem 37: 2808-24 (1994)
BindingDB Entry DOI: 10.7270/Q2M907QM
Angiotensin II type 1a (AT-1a) receptor
(RABBIT)
BDBM50039904
(4'-[3-Butyl-5-oxo-1-(2-trifluoromethyl-phenyl)-1,5...)
Show SMILES CCCCc1nn(-c2ccccc2C(F)(F)F)c(=O)n1Cc1ccc(cc1)-c1ccccc1S(=O)(=O)NC(=O)C1CCCCCC1
Show InChI InChI=1S/C34H37F3N4O4S/c1-2-3-18-31-38-41(29-16-10-9-15-28(29)34(35,36)37)33(43)40(31)23-24-19-21-25(22-20-24)27-14-8-11-17-30(27)46(44,45)39-32(42)26-12-6-4-5-7-13-26/h8-11,14-17,19-22,26H,2-7,12-13,18,23H2,1H3,(H,39,42)
n/an/a 0.300n/an/an/an/an/an/a
Merck Research Laboratories
Curated by ChEMBL
Assay Description
In vitro inhibitory activity against angiotensin II rabbit aorta AT1 receptor using radioligand [125I]-Sar Ile-AII
J Med Chem 37: 2808-24 (1994)
BindingDB Entry DOI: 10.7270/Q2M907QM