BDBM50039916 4'-[3-Butyl-5-oxo-1-(2-trifluoromethyl-phenyl)-1,5-dihydro-[1,2,4]triazol-4-ylmethyl]-biphenyl-2-sulfonic acid (thiophene-2-carbonyl)-amide::CHEMBL314812
SMILES: CCCCc1nn(-c2ccccc2C(F)(F)F)c(=O)n1Cc1ccc(cc1)-c1ccccc1S(=O)(=O)NC(=O)c1cccs1
InChI Key: InChIKey=ONISZXSDXWTXDP-UHFFFAOYSA-N
Data: 4 KI  2 IC50
Activity Spreadsheet -- Enzyme Inhibition Constant Data from BindingDB
Found 6 hits for monomerid = 50039916
Trg + Lig
Ki
nM
ΔG°
kcal/mole
IC50
nM
Kd
nM
EC50/IC50
nM
koff
s-1
kon
M-1s-1
pHTemp
°C
Prostaglandin E2 receptor EP4 subtype
(Homo sapiens (Human))
BDBM50039916
(4'-[3-Butyl-5-oxo-1-(2-trifluoromethyl-phenyl)-1,5...)
Show SMILES CCCCc1nn(-c2ccccc2C(F)(F)F)c(=O)n1Cc1ccc(cc1)-c1ccccc1S(=O)(=O)NC(=O)c1cccs1
Show InChI InChI=1S/C31H27F3N4O4S2/c1-2-3-14-28-35-38(25-11-6-5-10-24(25)31(32,33)34)30(40)37(28)20-21-15-17-22(18-16-21)23-9-4-7-13-27(23)44(41,42)36-29(39)26-12-8-19-43-26/h4-13,15-19H,2-3,14,20H2,1H3,(H,36,39)
Reactome pathway
46n/an/an/an/an/an/an/an/a
Merck Frosst Centre for Therapeutic Research
Curated by ChEMBL
Assay Description
Binding affinity at human Prostanoid EP4 receptor.
Bioorg Med Chem Lett 12: 2583-6 (2002)
BindingDB Entry DOI: 10.7270/Q2QN663S
Prostaglandin E2 receptor
(Homo sapiens (Human))
BDBM50039916
(4'-[3-Butyl-5-oxo-1-(2-trifluoromethyl-phenyl)-1,5...)
Show SMILES CCCCc1nn(-c2ccccc2C(F)(F)F)c(=O)n1Cc1ccc(cc1)-c1ccccc1S(=O)(=O)NC(=O)c1cccs1
Show InChI InChI=1S/C31H27F3N4O4S2/c1-2-3-14-28-35-38(25-11-6-5-10-24(25)31(32,33)34)30(40)37(28)20-21-15-17-22(18-16-21)23-9-4-7-13-27(23)44(41,42)36-29(39)26-12-8-19-43-26/h4-13,15-19H,2-3,14,20H2,1H3,(H,36,39)
7.00E+3n/an/an/an/an/an/an/an/a
Merck Frosst Centre for Therapeutic Research
Curated by ChEMBL
Assay Description
Binding affinity at human Prostanoid EP3 receptor.
Bioorg Med Chem Lett 12: 2583-6 (2002)
BindingDB Entry DOI: 10.7270/Q2QN663S
Prostaglandin E2 receptor EP1 subtype (EP1)
(Homo sapiens (Human))
BDBM50039916
(4'-[3-Butyl-5-oxo-1-(2-trifluoromethyl-phenyl)-1,5...)
Show SMILES CCCCc1nn(-c2ccccc2C(F)(F)F)c(=O)n1Cc1ccc(cc1)-c1ccccc1S(=O)(=O)NC(=O)c1cccs1
Show InChI InChI=1S/C31H27F3N4O4S2/c1-2-3-14-28-35-38(25-11-6-5-10-24(25)31(32,33)34)30(40)37(28)20-21-15-17-22(18-16-21)23-9-4-7-13-27(23)44(41,42)36-29(39)26-12-8-19-43-26/h4-13,15-19H,2-3,14,20H2,1H3,(H,36,39)
>1.00E+4n/an/an/an/an/an/an/an/a
Merck Frosst Centre for Therapeutic Research
Curated by ChEMBL
Assay Description
Binding affinity at human Prostanoid EP1 receptor.
Bioorg Med Chem Lett 12: 2583-6 (2002)
BindingDB Entry DOI: 10.7270/Q2QN663S
Prostaglandin E2 receptor EP2 subtype
(Homo sapiens (Human))
BDBM50039916
(4'-[3-Butyl-5-oxo-1-(2-trifluoromethyl-phenyl)-1,5...)
Show SMILES CCCCc1nn(-c2ccccc2C(F)(F)F)c(=O)n1Cc1ccc(cc1)-c1ccccc1S(=O)(=O)NC(=O)c1cccs1
Show InChI InChI=1S/C31H27F3N4O4S2/c1-2-3-14-28-35-38(25-11-6-5-10-24(25)31(32,33)34)30(40)37(28)20-21-15-17-22(18-16-21)23-9-4-7-13-27(23)44(41,42)36-29(39)26-12-8-19-43-26/h4-13,15-19H,2-3,14,20H2,1H3,(H,36,39)
Reactome pathway
>1.00E+4n/an/an/an/an/an/an/an/a
Merck Frosst Centre for Therapeutic Research
Curated by ChEMBL
Assay Description
Binding affinity at human Prostanoid EP2 receptor.
Bioorg Med Chem Lett 12: 2583-6 (2002)
BindingDB Entry DOI: 10.7270/Q2QN663S
Angiotensin II type 1a (AT-1a) receptor
(RABBIT)
BDBM50039916
(4'-[3-Butyl-5-oxo-1-(2-trifluoromethyl-phenyl)-1,5...)
Show SMILES CCCCc1nn(-c2ccccc2C(F)(F)F)c(=O)n1Cc1ccc(cc1)-c1ccccc1S(=O)(=O)NC(=O)c1cccs1
Show InChI InChI=1S/C31H27F3N4O4S2/c1-2-3-14-28-35-38(25-11-6-5-10-24(25)31(32,33)34)30(40)37(28)20-21-15-17-22(18-16-21)23-9-4-7-13-27(23)44(41,42)36-29(39)26-12-8-19-43-26/h4-13,15-19H,2-3,14,20H2,1H3,(H,36,39)
n/an/a 0.940n/an/an/an/an/an/a
Merck Research Laboratories
Curated by ChEMBL
Assay Description
In vitro inhibitory activity against angiotensin II rabbit aorta AT1 receptor using radioligand [125I]-Sar Ile-AII
J Med Chem 37: 2808-24 (1994)
BindingDB Entry DOI: 10.7270/Q2M907QM
Angiotensin II AT2
(RAT)
BDBM50039916
(4'-[3-Butyl-5-oxo-1-(2-trifluoromethyl-phenyl)-1,5...)
Show SMILES CCCCc1nn(-c2ccccc2C(F)(F)F)c(=O)n1Cc1ccc(cc1)-c1ccccc1S(=O)(=O)NC(=O)c1cccs1
Show InChI InChI=1S/C31H27F3N4O4S2/c1-2-3-14-28-35-38(25-11-6-5-10-24(25)31(32,33)34)30(40)37(28)20-21-15-17-22(18-16-21)23-9-4-7-13-27(23)44(41,42)36-29(39)26-12-8-19-43-26/h4-13,15-19H,2-3,14,20H2,1H3,(H,36,39)
n/an/a 540n/an/an/an/an/an/a
Merck Research Laboratories
Curated by ChEMBL
Assay Description
In vitro inhibitory activity against angiotensin II rat midbrain AT2 receptor using radioligand [125I]-Sar Ile-AII
J Med Chem 37: 2808-24 (1994)
BindingDB Entry DOI: 10.7270/Q2M907QM