BDBM50039930 4'-[3-Butyl-5-oxo-1-(2-trifluoromethyl-phenyl)-1,5-dihydro-[1,2,4]triazol-4-ylmethyl]-biphenyl-2-sulfonic acid (3,4-dichloro-furan-2-carbonyl)-amide; compound with dichloro-methane::CHEMBL329290
SMILES: CCCCc1nn(-c2ccccc2C(F)(F)F)c(=O)n1Cc1ccc(cc1)-c1ccccc1S(=O)(=O)NC(=O)c1occ(Cl)c1Cl
InChI Key: InChIKey=DOUAJXVODABWRT-UHFFFAOYSA-N
Data: 2 IC50
Activity Spreadsheet -- Enzyme Inhibition Constant Data from BindingDB
Found 2 hits for monomerid = 50039930
Trg + Lig
Ki
nM
ΔG°
kcal/mole
IC50
nM
Kd
nM
EC50/IC50
nM
koff
s-1
kon
M-1s-1
pHTemp
°C
Angiotensin II AT2
(RAT)
BDBM50039930
(4'-[3-Butyl-5-oxo-1-(2-trifluoromethyl-phenyl)-1,5...)
Show SMILES CCCCc1nn(-c2ccccc2C(F)(F)F)c(=O)n1Cc1ccc(cc1)-c1ccccc1S(=O)(=O)NC(=O)c1occ(Cl)c1Cl
Show InChI InChI=1S/C31H25Cl2F3N4O5S/c1-2-3-12-26-37-40(24-10-6-5-9-22(24)31(34,35)36)30(42)39(26)17-19-13-15-20(16-14-19)21-8-4-7-11-25(21)46(43,44)38-29(41)28-27(33)23(32)18-45-28/h4-11,13-16,18H,2-3,12,17H2,1H3,(H,38,41)
n/an/a 25n/an/an/an/an/an/a
Merck Research Laboratories
Curated by ChEMBL
Assay Description
In vitro inhibitory activity against angiotensin II rat midbrain AT2 receptor using radioligand [125I]-Sar Ile-AII
J Med Chem 37: 2808-24 (1994)
BindingDB Entry DOI: 10.7270/Q2M907QM
Angiotensin II type 1a (AT-1a) receptor
(RABBIT)
BDBM50039930
(4'-[3-Butyl-5-oxo-1-(2-trifluoromethyl-phenyl)-1,5...)
Show SMILES CCCCc1nn(-c2ccccc2C(F)(F)F)c(=O)n1Cc1ccc(cc1)-c1ccccc1S(=O)(=O)NC(=O)c1occ(Cl)c1Cl
Show InChI InChI=1S/C31H25Cl2F3N4O5S/c1-2-3-12-26-37-40(24-10-6-5-9-22(24)31(34,35)36)30(42)39(26)17-19-13-15-20(16-14-19)21-8-4-7-11-25(21)46(43,44)38-29(41)28-27(33)23(32)18-45-28/h4-11,13-16,18H,2-3,12,17H2,1H3,(H,38,41)
n/an/a 0.190n/an/an/an/an/an/a
Merck Research Laboratories
Curated by ChEMBL
Assay Description
In vitro inhibitory activity against angiotensin II rabbit aorta AT1 receptor using radioligand [125I]-Sar Ile-AII
J Med Chem 37: 2808-24 (1994)
BindingDB Entry DOI: 10.7270/Q2M907QM