BDBM50040314 (CH3)2PhCCH2(CO)His-Trp-Ala-Val-DAla-His-DPro(psi)Phe-NH2::CHEMBL264648
SMILES: CC(C)[C@H](NC(=O)[C@H](C)NC(=O)[C@H](Cc1c[nH]c2ccccc12)NC(=O)[C@H](Cc1cnc[nH]1)NC(=O)CC(C)(C)c1ccccc1)C(=O)N[C@H](C)C(=O)N[C@@H](Cc1cnc[nH]1)C(=O)N1CCC[C@@H]1CN[C@@H](Cc1ccccc1)C(N)=O
InChI Key: InChIKey=GTMCUXOCPBEAHY-UZACSEKYSA-N
Data: 2 IC50
Activity Spreadsheet -- Enzyme Inhibition Constant Data from BindingDB
Found 2 hits for monomerid = 50040314
Trg + Lig
Ki
nM
ΔG°
kcal/mole
IC50
nM
Kd
nM
EC50/IC50
nM
koff
s-1
kon
M-1s-1
pHTemp
°C
Gastrin releasing peptide receptor
(MOUSE)
BDBM50040314
((CH3)2PhCCH2(CO)His-Trp-Ala-Val-DAla-His-DPro(psi)...)
Show SMILES CC(C)[C@H](NC(=O)[C@H](C)NC(=O)[C@H](Cc1c[nH]c2ccccc12)NC(=O)[C@H](Cc1cnc[nH]1)NC(=O)CC(C)(C)c1ccccc1)C(=O)N[C@H](C)C(=O)N[C@@H](Cc1cnc[nH]1)C(=O)N1CCC[C@@H]1CN[C@@H](Cc1ccccc1)C(N)=O
Show InChI InChI=1S/C59H76N14O8/c1-35(2)51(57(80)68-36(3)53(76)71-49(27-42-31-62-34-66-42)58(81)73-23-15-20-43(73)32-64-46(52(60)75)24-38-16-9-7-10-17-38)72-54(77)37(4)67-55(78)47(25-39-29-63-45-22-14-13-21-44(39)45)70-56(79)48(26-41-30-61-33-65-41)69-50(74)28-59(5,6)40-18-11-8-12-19-40/h7-14,16-19,21-22,29-31,33-37,43,46-49,51,63-64H,15,20,23-28,32H2,1-6H3,(H2,60,75)(H,61,65)(H,62,66)(H,67,78)(H,68,80)(H,69,74)(H,70,79)(H,71,76)(H,72,77)/t36-,37+,43-,46+,47+,48+,49+,51+/m1/s1
Reactome pathway
n/an/a 10n/an/an/an/an/an/a
Burroughs Wellcome Company
Curated by ChEMBL
Assay Description
The ability of the peptide to inhibit the binding of 50 pM [125I]-Gastrin releasing peptide to intact S-3T3 cells
J Med Chem 37: 439-45 (1994)
BindingDB Entry DOI: 10.7270/Q2ST7NXN
Gastrin releasing peptide receptor
(MOUSE)
BDBM50040314
((CH3)2PhCCH2(CO)His-Trp-Ala-Val-DAla-His-DPro(psi)...)
Show SMILES CC(C)[C@H](NC(=O)[C@H](C)NC(=O)[C@H](Cc1c[nH]c2ccccc12)NC(=O)[C@H](Cc1cnc[nH]1)NC(=O)CC(C)(C)c1ccccc1)C(=O)N[C@H](C)C(=O)N[C@@H](Cc1cnc[nH]1)C(=O)N1CCC[C@@H]1CN[C@@H](Cc1ccccc1)C(N)=O
Show InChI InChI=1S/C59H76N14O8/c1-35(2)51(57(80)68-36(3)53(76)71-49(27-42-31-62-34-66-42)58(81)73-23-15-20-43(73)32-64-46(52(60)75)24-38-16-9-7-10-17-38)72-54(77)37(4)67-55(78)47(25-39-29-63-45-22-14-13-21-44(39)45)70-56(79)48(26-41-30-61-33-65-41)69-50(74)28-59(5,6)40-18-11-8-12-19-40/h7-14,16-19,21-22,29-31,33-37,43,46-49,51,63-64H,15,20,23-28,32H2,1-6H3,(H2,60,75)(H,61,65)(H,62,66)(H,67,78)(H,68,80)(H,69,74)(H,70,79)(H,71,76)(H,72,77)/t36-,37+,43-,46+,47+,48+,49+,51+/m1/s1
Reactome pathway
n/an/a 1.20n/an/an/an/an/an/a
Burroughs Wellcome Company
Curated by ChEMBL
Assay Description
Ability of peptide to inhibit binding of 10 pM [125I]-gastrin releasing peptide to S-3T3 cell membrane.
J Med Chem 37: 439-45 (1994)
BindingDB Entry DOI: 10.7270/Q2ST7NXN