BDBM50040364 8-Amino-1,3-bis-cyclopropylmethyl-7-(3-trifluoromethyl-benzenesulfonyl)-3,7-dihydro-purine-2,6-dione::CHEMBL356138
SMILES: Nc1nc2n(CC3CC3)c(=O)n(CC3CC3)c(=O)c2n1S(=O)(=O)c1cccc(c1)C(F)(F)F
InChI Key: InChIKey=GIDZGZWKIWPZDW-UHFFFAOYSA-N
Data: 1 IC50
Activity Spreadsheet -- Enzyme Inhibition Constant Data from BindingDB
Found 1 hit for monomerid = 50040364
Trg + Lig
Ki
nM
ΔG°
kcal/mole
IC50
nM
Kd
nM
EC50/IC50
nM
koff
s-1
kon
M-1s-1
pHTemp
°C
cGMP-specific 3',5'-cyclic phosphodiesterase
(Homo sapiens (Human))
BDBM50040364
(8-Amino-1,3-bis-cyclopropylmethyl-7-(3-trifluorome...)
Show SMILES Nc1nc2n(CC3CC3)c(=O)n(CC3CC3)c(=O)c2n1S(=O)(=O)c1cccc(c1)C(F)(F)F
Show InChI InChI=1S/C20H20F3N5O4S/c21-20(22,23)13-2-1-3-14(8-13)33(31,32)28-15-16(25-18(28)24)26(9-11-4-5-11)19(30)27(17(15)29)10-12-6-7-12/h1-3,8,11-12H,4-7,9-10H2,(H2,24,25)
Reactome pathway
n/an/a 3.70E+4n/an/an/an/an/an/a
SmithKline Beecham Pharmaceuticals
Curated by ChEMBL
Assay Description
Concentration required to inhibit 50% activity of phosphodiesterase VA isoenzyme at 100 microM.
J Med Chem 37: 476-85 (1994)
BindingDB Entry DOI: 10.7270/Q2P26X6N