BDBM50040899 CHEMBL3353820
SMILES: Brc1ccc2c(c1)[nH]c1nc(SCc3ccccc3C#N)nnc21
InChI Key: InChIKey=CTZDCYRRDOHEHF-UHFFFAOYSA-N
Data: 1 EC50
Activity Spreadsheet -- Enzyme Inhibition Constant Data from BindingDB
Found 1 hit for monomerid = 50040899
Trg + Lig
Ki
nM
ΔG°
kcal/mole
IC50
nM
Kd
nM
EC50/IC50
nM
koff
s-1
kon
M-1s-1
pHTemp
°C
Cannabinoid receptor 2
(Homo sapiens (Human))
BDBM50040899
(CHEMBL3353820)
Show SMILES Brc1ccc2c(c1)[nH]c1nc(SCc3ccccc3C#N)nnc21
Show InChI InChI=1S/C17H10BrN5S/c18-12-5-6-13-14(7-12)20-16-15(13)22-23-17(21-16)24-9-11-4-2-1-3-10(11)8-19/h1-7H,9H2,(H,20,21,23)
Reactome pathway
n/an/an/an/a>3.00E+3n/an/an/an/a
University of Oxford
Curated by ChEMBL
Assay Description
Agonist activity at human CB2R expressed in CHO cells assessed as reduction in forskolin-induced cAMP accumulation by beta-galactosidase based comple...
Bioorg Med Chem 23: 241-63 (2014)
Article DOI: 10.1016/j.bmc.2014.11.002
BindingDB Entry DOI: 10.7270/Q2930VS3