BDBM50040941 CHEMBL3353840
SMILES: CC(=O)n1c2ccccc2c2nnc(SCc3ccccc3C#N)nc12
InChI Key: InChIKey=QAEXFTUIMFUWCK-UHFFFAOYSA-N
Data: 1 EC50
Activity Spreadsheet -- Enzyme Inhibition Constant Data from BindingDB
Found 1 hit for monomerid = 50040941
Trg + Lig
Ki
nM
ΔG°
kcal/mole
IC50
nM
Kd
nM
EC50/IC50
nM
koff
s-1
kon
M-1s-1
pHTemp
°C
Cannabinoid receptor 2
(Homo sapiens (Human))
BDBM50040941
(CHEMBL3353840)
Show SMILES CC(=O)n1c2ccccc2c2nnc(SCc3ccccc3C#N)nc12
Show InChI InChI=1S/C19H13N5OS/c1-12(25)24-16-9-5-4-8-15(16)17-18(24)21-19(23-22-17)26-11-14-7-3-2-6-13(14)10-20/h2-9H,11H2,1H3
Reactome pathway
n/an/an/an/a>3.00E+3n/an/an/an/a
University of Oxford
Curated by ChEMBL
Assay Description
Agonist activity at human CB2R expressed in CHO cells assessed as reduction in forskolin-induced cAMP accumulation by beta-galactosidase based comple...
Bioorg Med Chem 23: 241-63 (2014)
Article DOI: 10.1016/j.bmc.2014.11.002
BindingDB Entry DOI: 10.7270/Q2930VS3