BDBM50041052 2-(2-Mercaptomethyl-3-phenyl-butyrylamino)-butyric acid::CHEMBL6915
SMILES: CCC(NC(=O)C(CS)C(C)c1ccccc1)C(O)=O
InChI Key: InChIKey=CJIDAJDLTKDLOL-UHFFFAOYSA-N
Data: 2 IC50
Activity Spreadsheet -- Enzyme Inhibition Constant Data from BindingDB
Found 2 hits for monomerid = 50041052
Trg + Lig
Ki
nM
ΔG°
kcal/mole
IC50
nM
Kd
nM
EC50/IC50
nM
koff
s-1
kon
M-1s-1
pHTemp
°C
Neprilysin
(Homo sapiens (Human))
BDBM50041052
(2-(2-Mercaptomethyl-3-phenyl-butyrylamino)-butyric...)
Show SMILES CCC(NC(=O)C(CS)C(C)c1ccccc1)C(O)=O
Show InChI InChI=1S/C15H21NO3S/c1-3-13(15(18)19)16-14(17)12(9-20)10(2)11-7-5-4-6-8-11/h4-8,10,12-13,20H,3,9H2,1-2H3,(H,16,17)(H,18,19)
n/an/a 6.30n/an/an/an/an/an/a
INSERM
Curated by ChEMBL
Assay Description
In vivo inhibitory potency against neutral endopeptidase by displacement of [3H]-HACBOGly binding in mouse kidney
J Med Chem 37: 1070-83 (1994)
BindingDB Entry DOI: 10.7270/Q26W995T
Angiotensin-converting enzyme
(Mus musculus)
BDBM50041052
(2-(2-Mercaptomethyl-3-phenyl-butyrylamino)-butyric...)
Show SMILES CCC(NC(=O)C(CS)C(C)c1ccccc1)C(O)=O
Show InChI InChI=1S/C15H21NO3S/c1-3-13(15(18)19)16-14(17)12(9-20)10(2)11-7-5-4-6-8-11/h4-8,10,12-13,20H,3,9H2,1-2H3,(H,16,17)(H,18,19)
Reactome pathway
n/an/a 5.40n/an/an/an/an/an/a
INSERM
Curated by ChEMBL
Assay Description
Inhibitory potency against angiotensin converting enzyme by displacement of [3H]-trandolaprilate binding in mouse lung
J Med Chem 37: 1070-83 (1994)
BindingDB Entry DOI: 10.7270/Q26W995T