BDBM50041502 Acetic acid 5-(4-methoxy-phenyl)-6-thia-10b-aza-benzo[e]azulen-4-yl ester::CHEMBL33165
SMILES: COc1ccc(cc1)C1=C(OC(C)=O)c2cccn2-c2ccccc2S1
InChI Key: InChIKey=NCWRHYSPTPPIQP-UHFFFAOYSA-N
Data: 4 IC50
Activity Spreadsheet -- Enzyme Inhibition Constant Data from BindingDB
Found 4 hits for monomerid = 50041502
Trg + Lig
Ki
nM
ΔG°
kcal/mole
IC50
nM
Kd
nM
EC50/IC50
nM
koff
s-1
kon
M-1s-1
pHTemp
°C
Peripheral-Type Benzodiazepine Receptor
(Rattus norvegicus (rat))
BDBM50041502
(Acetic acid 5-(4-methoxy-phenyl)-6-thia-10b-aza-be...)
Show SMILES COc1ccc(cc1)C1=C(OC(C)=O)c2cccn2-c2ccccc2S1 |c:9|
Show InChI InChI=1S/C21H17NO3S/c1-14(23)25-20-18-7-5-13-22(18)17-6-3-4-8-19(17)26-21(20)15-9-11-16(24-2)12-10-15/h3-13H,1-2H3
n/an/a 34n/an/an/an/an/an/a
Universit£ di Napoli
Curated by ChEMBL
Assay Description
Displacement of [3H]-PK 11195 from rat peripheral (mitochondrial) benzodiazepine receptor
J Med Chem 37: 4100-8 (1995)
BindingDB Entry DOI: 10.7270/Q2XD129C
Peripheral-Type Benzodiazepine Receptor
(Rattus norvegicus (rat))
BDBM50041502
(Acetic acid 5-(4-methoxy-phenyl)-6-thia-10b-aza-be...)
Show SMILES COc1ccc(cc1)C1=C(OC(C)=O)c2cccn2-c2ccccc2S1 |c:9|
Show InChI InChI=1S/C21H17NO3S/c1-14(23)25-20-18-7-5-13-22(18)17-6-3-4-8-19(17)26-21(20)15-9-11-16(24-2)12-10-15/h3-13H,1-2H3
n/an/a 34n/an/an/an/an/an/a
Universit£ di Siena
Curated by ChEMBL
Assay Description
Ability to inhibit [3H]-PK 11195 binding to peripheral-type benzodiazepine receptor(PBR) in rat cerebral cortex homogenate.
J Med Chem 39: 2922-38 (1996)
Article DOI: 10.1021/jm960162z
BindingDB Entry DOI: 10.7270/Q2HH6KQ5
Calcium channel
(RAT)
BDBM50041502
(Acetic acid 5-(4-methoxy-phenyl)-6-thia-10b-aza-be...)
Show SMILES COc1ccc(cc1)C1=C(OC(C)=O)c2cccn2-c2ccccc2S1 |c:9|
Show InChI InChI=1S/C21H17NO3S/c1-14(23)25-20-18-7-5-13-22(18)17-6-3-4-8-19(17)26-21(20)15-9-11-16(24-2)12-10-15/h3-13H,1-2H3
n/an/a 340n/an/an/an/an/an/a
Universit£ di Siena
Curated by ChEMBL
Assay Description
Ability to inhibit [3H]nitrendipine binding to the L-type calcium channel receptor(CCR) in rat heart homogenate.
J Med Chem 39: 2922-38 (1996)
Article DOI: 10.1021/jm960162z
BindingDB Entry DOI: 10.7270/Q2HH6KQ5
Peripheral-Type Benzodiazepine Receptor
(Rattus norvegicus (rat))
BDBM50041502
(Acetic acid 5-(4-methoxy-phenyl)-6-thia-10b-aza-be...)
Show SMILES COc1ccc(cc1)C1=C(OC(C)=O)c2cccn2-c2ccccc2S1 |c:9|
Show InChI InChI=1S/C21H17NO3S/c1-14(23)25-20-18-7-5-13-22(18)17-6-3-4-8-19(17)26-21(20)15-9-11-16(24-2)12-10-15/h3-13H,1-2H3
n/an/a 34n/an/an/an/an/an/a
Universit£ di Siena
Curated by ChEMBL
Assay Description
Displacement of [3H]-PK 11195 from peripheral (mitochondrial) benzodiazepine receptor
J Med Chem 37: 1427-38 (1994)
BindingDB Entry DOI: 10.7270/Q2668DVR