BDBM50041512 5-Phenyl-6-thia-10b-aza-benzo[e]azulen-4-one::CHEMBL32718
SMILES: O=C1C(Sc2ccccc2-n2cccc12)c1ccccc1
InChI Key: InChIKey=NZZPYZUATMBWAV-UHFFFAOYSA-N
Data: 4 IC50
Activity Spreadsheet -- Enzyme Inhibition Constant Data from BindingDB
Found 4 hits for monomerid = 50041512
Trg + Lig
Ki
nM
ΔG°
kcal/mole
IC50
nM
Kd
nM
EC50/IC50
nM
koff
s-1
kon
M-1s-1
pHTemp
°C
Peripheral-Type Benzodiazepine Receptor
(Rattus norvegicus (rat))
BDBM50041512
(5-Phenyl-6-thia-10b-aza-benzo[e]azulen-4-one | CHE...)
Show SMILES O=C1C(Sc2ccccc2-n2cccc12)c1ccccc1
Show InChI InChI=1S/C18H13NOS/c20-17-15-10-6-12-19(15)14-9-4-5-11-16(14)21-18(17)13-7-2-1-3-8-13/h1-12,18H
n/an/a 1.23E+3n/an/an/an/an/an/a
Universit£ di Napoli
Curated by ChEMBL
Assay Description
Displacement of [3H]-PK 11195 from rat peripheral (mitochondrial) benzodiazepine receptor
J Med Chem 37: 4100-8 (1995)
BindingDB Entry DOI: 10.7270/Q2XD129C
Peripheral-Type Benzodiazepine Receptor
(Rattus norvegicus (rat))
BDBM50041512
(5-Phenyl-6-thia-10b-aza-benzo[e]azulen-4-one | CHE...)
Show SMILES O=C1C(Sc2ccccc2-n2cccc12)c1ccccc1
Show InChI InChI=1S/C18H13NOS/c20-17-15-10-6-12-19(15)14-9-4-5-11-16(14)21-18(17)13-7-2-1-3-8-13/h1-12,18H
n/an/a 1.22E+3n/an/an/an/an/an/a
Universit£ di Siena
Curated by ChEMBL
Assay Description
Displacement of [3H]-PK 11195 from peripheral (mitochondrial) benzodiazepine receptor
J Med Chem 37: 1427-38 (1994)
BindingDB Entry DOI: 10.7270/Q2668DVR
Adenosine kinase
(Homo sapiens (Human))
BDBM50041512
(5-Phenyl-6-thia-10b-aza-benzo[e]azulen-4-one | CHE...)
Show SMILES O=C1C(Sc2ccccc2-n2cccc12)c1ccccc1
Show InChI InChI=1S/C18H13NOS/c20-17-15-10-6-12-19(15)14-9-4-5-11-16(14)21-18(17)13-7-2-1-3-8-13/h1-12,18H
Reactome pathway
n/an/a 1.30E+5n/an/an/an/an/an/a
Universita` di Siena
Curated by ChEMBL
Assay Description
Inhibition of human adenosine kinase
J Med Chem 54: 1401-20 (2011)
Article DOI: 10.1021/jm101438u
BindingDB Entry DOI: 10.7270/Q2XD120B
Human immunodeficiency virus type 1 reverse transcriptase
(Human immunodeficiency virus 1)
BDBM50041512
(5-Phenyl-6-thia-10b-aza-benzo[e]azulen-4-one | CHE...)
Show SMILES O=C1C(Sc2ccccc2-n2cccc12)c1ccccc1
Show InChI InChI=1S/C18H13NOS/c20-17-15-10-6-12-19(15)14-9-4-5-11-16(14)21-18(17)13-7-2-1-3-8-13/h1-12,18H
n/an/a 1.00E+5n/an/an/an/an/an/a
Universitá di Siena
Curated by ChEMBL
Assay Description
Compound was tested for Inhibition of HIV-1 RT activity.
J Med Chem 39: 2672-80 (1996)
Article DOI: 10.1021/jm950702c
BindingDB Entry DOI: 10.7270/Q21R6PM4