null
SMILES: C[C@H](N1C[C@@H](C)[C@@H](CN(C)C(=O)Nc2ccc(cc2)C(F)(F)F)Oc2c(NS(=O)(=O)c3ccccc3)cccc2C1=O)C(O)=O
InChI Key: InChIKey=YEXDVZLSDDXMCZ-HHJKRLRDSA-N
Activity Spreadsheet -- Enzyme Inhibition Constant Data from BindingDB
Found 1 hit for monomerid = 50041674
Trg + Lig
Ki
nM
ΔG°
kcal/mole
IC50
nM
Kd
nM
EC50/IC50
nM
koff
s-1
kon
M-1s-1
pHTemp
°C
Induced myeloid leukemia cell differentiation protein Mcl-1
(Homo sapiens (Human))
BDBM50041674
(CHEMBL3358901)
Show SMILES C[C@H](N1C[C@@H](C)[C@@H](CN(C)C(=O)Nc2ccc(cc2)C(F)(F)F)Oc2c(NS(=O)(=O)c3ccccc3)cccc2C1=O)C(O)=O |r|
Show InChI InChI=1S/C30H31F3N4O7S/c1-18-16-37(19(2)28(39)40)27(38)23-10-7-11-24(35-45(42,43)22-8-5-4-6-9-22)26(23)44-25(18)17-36(3)29(41)34-21-14-12-20(13-15-21)30(31,32)33/h4-15,18-19,25,35H,16-17H2,1-3H3,(H,34,41)(H,39,40)/t18-,19+,25-/m1/s1
NCI pathway
n/an/a 1.00E+4n/an/an/an/an/an/a
Institute
Curated by ChEMBL
Assay Description
Binding affinity to human MCL1 (173 to 329 aa) using TAMRA-labeled Noxa peptide preincubated for 30 mins by fluorescent polarization assay
ACS Med Chem Lett 5: 1308-12 (2014)
Article DOI: 10.1021/ml500388q
BindingDB Entry DOI: 10.7270/Q2FN17VP