null
SMILES: C[C@H](N1C[C@@H](C)[C@@H](CN(C)C(=O)Nc2cccc3ccccc23)Oc2c(NS(=O)(=O)c3ccc(F)cc3)cccc2C1=O)C(O)=O
InChI Key: InChIKey=RDGGAUJCTPSLIS-HNMNOHOESA-N
Activity Spreadsheet -- Enzyme Inhibition Constant Data from BindingDB
Found 1 hit for monomerid = 50041685
Trg + Lig
Ki
nM
ΔG°
kcal/mole
IC50
nM
Kd
nM
EC50/IC50
nM
koff
s-1
kon
M-1s-1
pHTemp
°C
Induced myeloid leukemia cell differentiation protein Mcl-1
(Homo sapiens (Human))
BDBM50041685
(CHEMBL3358897)
Show SMILES C[C@H](N1C[C@@H](C)[C@@H](CN(C)C(=O)Nc2cccc3ccccc23)Oc2c(NS(=O)(=O)c3ccc(F)cc3)cccc2C1=O)C(O)=O |r|
Show InChI InChI=1S/C33H33FN4O7S/c1-20-18-38(21(2)32(40)41)31(39)26-11-7-13-28(36-46(43,44)24-16-14-23(34)15-17-24)30(26)45-29(20)19-37(3)33(42)35-27-12-6-9-22-8-4-5-10-25(22)27/h4-17,20-21,29,36H,18-19H2,1-3H3,(H,35,42)(H,40,41)/t20-,21+,29-/m1/s1
NCI pathway
n/an/a>5.00E+4n/an/an/an/an/an/a
Institute
Curated by ChEMBL
Assay Description
Binding affinity to human MCL1 (173 to 329 aa) using TAMRA-labeled Noxa peptide preincubated for 30 mins by fluorescent polarization assay
ACS Med Chem Lett 5: 1308-12 (2014)
Article DOI: 10.1021/ml500388q
BindingDB Entry DOI: 10.7270/Q2FN17VP