BDBM50041703 CHEMBL3358912
SMILES: OC(=O)CC1CCc2c1[nH]c1ccc(OCc3ccc(C4CCCC4)c(c3)C(F)(F)F)cc21
InChI Key: InChIKey=MVGWUTBTXDYMND-UHFFFAOYSA-N
Data: 1 EC50
Activity Spreadsheet -- Enzyme Inhibition Constant Data from BindingDB
Found 1 hit for monomerid = 50041703
Trg + Lig
Ki
nM
ΔG°
kcal/mole
IC50
nM
Kd
nM
EC50/IC50
nM
koff
s-1
kon
M-1s-1
pHTemp
°C
Sphingosine 1-phosphate receptor 1
(Homo sapiens (Human))
BDBM50041703
(CHEMBL3358912)
Show SMILES OC(=O)CC1CCc2c1[nH]c1ccc(OCc3ccc(C4CCCC4)c(c3)C(F)(F)F)cc21
Show InChI InChI=1S/C26H26F3NO3/c27-26(28,29)22-11-15(5-8-19(22)16-3-1-2-4-16)14-33-18-7-10-23-21(13-18)20-9-6-17(12-24(31)32)25(20)30-23/h5,7-8,10-11,13,16-17,30H,1-4,6,9,12,14H2,(H,31,32)
Reactome pathway
n/an/an/an/a 0.0730n/an/an/an/a
Arena Pharmaceuticals, Inc.
Curated by ChEMBL
Assay Description
Agonist activity at human S1P1 receptor assessed as cAMP accumulation by HTRF assay
ACS Med Chem Lett 5: 1313-7 (2014)
Article DOI: 10.1021/ml500389m
BindingDB Entry DOI: 10.7270/Q29W0H4C