null
SMILES: OC(=O)CC1CCc2c1[nH]c1ccc(OCc3ccc(OC(F)(F)F)c(c3)C#N)cc21
InChI Key:
Activity Spreadsheet -- Enzyme Inhibition Constant Data from BindingDB
Found 1 hit for monomerid = 50041811
Trg + Lig
Ki
nM
ΔG°
kcal/mole
IC50
nM
Kd
nM
EC50/IC50
nM
koff
s-1
kon
M-1s-1
pHTemp
°C
Sphingosine 1-phosphate receptor 1
(Homo sapiens (Human))
BDBM50041811
(CHEMBL3358906)
Show SMILES OC(=O)CC1CCc2c1[nH]c1ccc(OCc3ccc(OC(F)(F)F)c(c3)C#N)cc21
Reactome pathway
n/an/an/an/a 1.70n/an/an/an/a
Arena Pharmaceuticals, Inc.
Curated by ChEMBL
Assay Description
Agonist activity at human S1P1 receptor assessed as cAMP accumulation by HTRF assay
ACS Med Chem Lett 5: 1313-7 (2014)
Article DOI: 10.1021/ml500389m
BindingDB Entry DOI: 10.7270/Q29W0H4C