BDBM50041838 3-(cyclopentyloxy)-N-(2,6-dichlorophenyl)-4-methoxybenzamide::3-Cyclopentyloxy-N-(2,6-dichloro-phenyl)-4-methoxy-benzamide::CHEMBL45834
SMILES: COc1ccc(cc1OC1CCCC1)C(=O)Nc1c(Cl)cccc1Cl
InChI Key: InChIKey=IEIYCAUGLWVZTR-UHFFFAOYSA-N
Data: 3 IC50
Activity Spreadsheet -- Enzyme Inhibition Constant Data from BindingDB
Found 3 hits for monomerid = 50041838
Trg + Lig
Ki
nM
ΔG°
kcal/mole
IC50
nM
Kd
nM
EC50/IC50
nM
koff
s-1
kon
M-1s-1
pHTemp
°C
cGMP-specific 3',5'-cyclic phosphodiesterase
(Homo sapiens (Human))
BDBM50041838
(3-(cyclopentyloxy)-N-(2,6-dichlorophenyl)-4-methox...)
Show SMILES COc1ccc(cc1OC1CCCC1)C(=O)Nc1c(Cl)cccc1Cl
Show InChI InChI=1S/C19H19Cl2NO3/c1-24-16-10-9-12(11-17(16)25-13-5-2-3-6-13)19(23)22-18-14(20)7-4-8-15(18)21/h4,7-11,13H,2-3,5-6H2,1H3,(H,22,23)
Reactome pathway
n/an/a>1.00E+6n/an/an/an/an/an/a
Rhône-Poulenc Rorer Central Research
Curated by ChEMBL
Assay Description
Inhibitory potency against pig aortic PDE V.
J Med Chem 37: 1696-703 (1994)
BindingDB Entry DOI: 10.7270/Q2CF9P5F
cAMP-specific 3',5'-cyclic phosphodiesterase 4D
(Homo sapiens (Human))
BDBM50041838
(3-(cyclopentyloxy)-N-(2,6-dichlorophenyl)-4-methox...)
Show SMILES COc1ccc(cc1OC1CCCC1)C(=O)Nc1c(Cl)cccc1Cl
Show InChI InChI=1S/C19H19Cl2NO3/c1-24-16-10-9-12(11-17(16)25-13-5-2-3-6-13)19(23)22-18-14(20)7-4-8-15(18)21/h4,7-11,13H,2-3,5-6H2,1H3,(H,22,23)
n/an/a 28n/an/an/an/an/an/a
Georgia State University
Curated by ChEMBL
Assay Description
Inhibition of full length human PDE4D2 expressed in Escherichia coli BL21 by liquid scintillation counting
J Med Chem 51: 7673-88 (2008)
Article DOI: 10.1021/jm701635j
BindingDB Entry DOI: 10.7270/Q2736QRN
Phosphodiesterase 4A
(Sus scrofa)
BDBM50041838
(3-(cyclopentyloxy)-N-(2,6-dichlorophenyl)-4-methox...)
Show SMILES COc1ccc(cc1OC1CCCC1)C(=O)Nc1c(Cl)cccc1Cl
Show InChI InChI=1S/C19H19Cl2NO3/c1-24-16-10-9-12(11-17(16)25-13-5-2-3-6-13)19(23)22-18-14(20)7-4-8-15(18)21/h4,7-11,13H,2-3,5-6H2,1H3,(H,22,23)
n/an/a 23n/an/an/an/an/an/a
Rhône-Poulenc Rorer Central Research
Curated by ChEMBL
Assay Description
Inhibitory potency against pig aortic PDE IV
J Med Chem 37: 1696-703 (1994)
BindingDB Entry DOI: 10.7270/Q2CF9P5F