BDBM50041855 CHEMBL45128::N-(2-Chloro-6-fluoro-phenyl)-3-cyclopentyloxy-4-methoxy-benzamide
SMILES: COc1ccc(cc1OC1CCCC1)C(=O)Nc1c(F)cccc1Cl
InChI Key: InChIKey=DOLGQELLEXSAGJ-UHFFFAOYSA-N
Data: 2 IC50
Activity Spreadsheet -- Enzyme Inhibition Constant Data from BindingDB
Found 2 hits for monomerid = 50041855
Trg + Lig
Ki
nM
ΔG°
kcal/mole
IC50
nM
Kd
nM
EC50/IC50
nM
koff
s-1
kon
M-1s-1
pHTemp
°C
Phosphodiesterase 4A
(Sus scrofa)
BDBM50041855
(CHEMBL45128 | N-(2-Chloro-6-fluoro-phenyl)-3-cyclo...)
Show SMILES COc1ccc(cc1OC1CCCC1)C(=O)Nc1c(F)cccc1Cl
Show InChI InChI=1S/C19H19ClFNO3/c1-24-16-10-9-12(11-17(16)25-13-5-2-3-6-13)19(23)22-18-14(20)7-4-8-15(18)21/h4,7-11,13H,2-3,5-6H2,1H3,(H,22,23)
n/an/a 240n/an/an/an/an/an/a
Rhône-Poulenc Rorer Central Research
Curated by ChEMBL
Assay Description
Inhibitory potency against pig aortic PDE IV
J Med Chem 37: 1696-703 (1994)
BindingDB Entry DOI: 10.7270/Q2CF9P5F
cGMP-specific 3',5'-cyclic phosphodiesterase
(Homo sapiens (Human))
BDBM50041855
(CHEMBL45128 | N-(2-Chloro-6-fluoro-phenyl)-3-cyclo...)
Show SMILES COc1ccc(cc1OC1CCCC1)C(=O)Nc1c(F)cccc1Cl
Show InChI InChI=1S/C19H19ClFNO3/c1-24-16-10-9-12(11-17(16)25-13-5-2-3-6-13)19(23)22-18-14(20)7-4-8-15(18)21/h4,7-11,13H,2-3,5-6H2,1H3,(H,22,23)
Reactome pathway
n/an/a>1.00E+6n/an/an/an/an/an/a
Rhône-Poulenc Rorer Central Research
Curated by ChEMBL
Assay Description
Inhibitory potency against pig aortic PDE V.
J Med Chem 37: 1696-703 (1994)
BindingDB Entry DOI: 10.7270/Q2CF9P5F