null
SMILES: COc1ccc(cc1OC1CCCC1)C(=S)Nc1ccccc1Cl
InChI Key: InChIKey=TZJUMNXKWAGZNN-UHFFFAOYSA-N
Activity Spreadsheet -- Enzyme Inhibition Constant Data from BindingDB
Found 1 hit for monomerid = 50041883
Trg + Lig
Ki
nM
ΔG°
kcal/mole
IC50
nM
Kd
nM
EC50/IC50
nM
koff
s-1
kon
M-1s-1
pHTemp
°C
3',5'-cyclic-AMP phosphodiesterase
(Sus scrofa)
BDBM50041883
(CHEMBL45359 | N-(2-Chloro-phenyl)-3-cyclopentyloxy...)
Show SMILES COc1ccc(cc1OC1CCCC1)C(=S)Nc1ccccc1Cl
Show InChI InChI=1S/C19H20ClNO2S/c1-22-17-11-10-13(12-18(17)23-14-6-2-3-7-14)19(24)21-16-9-5-4-8-15(16)20/h4-5,8-12,14H,2-3,6-7H2,1H3,(H,21,24)
n/an/a 200n/an/an/an/an/an/a
Rhône-Poulenc Rorer Central Research
Curated by ChEMBL
Assay Description
Inhibitory potency against pig aortic PDE IV
J Med Chem 37: 1696-703 (1994)
BindingDB Entry DOI: 10.7270/Q2CF9P5F